{"text_format":"1","workbook":"xlsx","n_sheets":9,"sheets":["FLCC Instructions","FLCC Exhibit B","FLCC CSI Cost Estimate Summary","GMP Instructions","GMP Exhibit C","GMP Trade Contractor Bid Sum","GMP Trade Contractor Bid - FLCC","Copy Me","List"],"not_rendered":{"charts":0,"images":0,"macros":1,"external_links":1,"defined_names":7,"comments":0,"pivot_tables":0},"unopened":[],"bounds":{"document_bytes":16777216,"sheet_cells":100000,"rows_first":2000,"rows_last":500,"rows_between":2000,"halvings":0,"cell_chars":16384,"cell_head_chars":4096},"cells_cut":0,"cells_raw":0,"read":"whole","date_system":"1900"}

{"sheet":"FLCC Instructions","index":0,"n_rows":44,"n_cols":16,"rows_kept":44,"cut":false,"hidden":false,"merged":[[14,1,14,13],[21,0,21,2],[34,1,34,8],[12,0,12,7],[13,1,13,14],[22,1,22,12],[27,0,27,1],[25,1,25,12],[0,15,0,16],[4,0,4,8],[6,0,6,17],[10,1,10,8],[9,0,9,3],[1,0,1,2],[24,0,24,1],[31,1,31,8],[19,1,19,9],[40,1,40,7],[33,0,33,4]]}
[null,null,null,null,null,null,null,null,null,null," = to be completed by CM",null,null,null,null,"Rev. 6/14/24"]
["FLCC Proposal",null,null,null,null,null,null,null,null,null," = predetermined or automatic calculation"]
[]
[]
["Section B.1. CSI Cost Estimate - Instructions for Completion"]
[]
["Proposals for Trade Contractor work and any Self-Performed work (Not to Exceed 20% of Total) must be detailed and summarized per the following \"column\" instructions:"]
[]
[]
["Scope/Trade Category"]
[null,"• List all applicable Trade Categories in sequential order by CSI Numbers."]
[]
["Proposed Trade Contractor, Self-Perform Work and Estimates and TBD"]
[null,"• Estimates can be provided in lieu of self-performing or bidding work. If an Estimate is provided and it's intended to be Bid on the GMP, indicate TBD. If the Estimate is intended to be Self-Performed on the GMP, indicate Self-Perform and check the 'Yes' box in the Self-Performed column. "]
[null,"• List all bidders that were provided a bidding document in order of bid results from lowest to highest proposed amounts."]
[null,"• A minimum of three (3) bidders are required per trade category. If there are less than 3 bidders, provide detail explanation in Contractor Scope/Trade Detail:"]
[null,"• Bidders that do not provide a bid response select \"No Response\" in drop down menu"]
[null,"• Bidders that responded but provide No Bid select \"Decline to Bid\" in drop down menu"]
[null,"• Self-Perform Work, please check box \"Self Perform\", If it exceeds 20%, provide explanation in Detail the Reason Self-Performed Total Exceeds 20%"]
[null,"(Note Self-Perform detail will automatically load in Self-Perform section below CSI Cost Estimate Summary)"]
[]
["Proposed Amounts"]
[null,"• List bid amounts from lowest to highest on the basis of base bid including intended alternates to be awarded."]
[]
["Estimate"]
[null,"• Check the 'Yes' box if an estimate was provided in lieu of a bid amount. "]
[]
["Selected Firm"]
[null,"• Automatically selected based on the lowest bid amount from the lowest entered Proposed Trade column. "]
[]
["EMR"]
[null,"• Enter the most current EMR for each Trade Contractor submitting a proposal."]
[]
["Intended Awardee Proposal Detail"]
[null,"• Enter intended base bid and accepted alternate amounts to be awarded."]
[]
["Total"]
[null,"• Automatically entered from Intended Awardee Proposal column  as a lump sum including accepted alternates."]
[]
["Trade Contractor Total including any Self-Perform Amounts (Not to Exceed 20% of Total)"]
[null,"• This amount must reflect the sum of all totals in the last column"]
[]
["Full Time Laborer "]
[null,"• If a full time laborer is contractually required, their time should be entered into this section. "]

{"sheet":"FLCC Exhibit B","index":1,"n_rows":111,"n_cols":11,"rows_kept":111,"cut":false,"hidden":false,"merged":[[10,4,10,5],[60,3,60,6],[77,0,77,1],[57,0,57,1],[58,0,58,1],[59,0,59,1],[60,0,60,1],[66,6,66,7],[32,4,32,5],[19,4,19,5],[35,3,35,10],[36,3,36,10],[69,2,69,5],[70,2,70,5],[71,2,71,5],[77,4,77,6],[11,8,11,9],[16,0,16,1],[16,4,16,7],[17,4,17,7],[11,4,11,6],[0,9,0,10],[64,8,64,9],[76,4,76,6],[18,4,18,7],[18,8,18,9],[41,0,49,10],[76,0,76,1],[57,8,57,10],[58,8,58,10],[59,8,59,10],[60,8,60,10],[57,3,57,6],[58,3,58,6],[59,3,59,6],[6,0,6,1],[34,3,34,10],[80,0,80,1],[80,4,80,6],[81,0,81,1],[81,4,81,6],[78,0,78,1],[78,4,78,6],[79,0,79,1],[79,4,79,6],[255,4,255,6],[82,0,82,1],[82,4,82,6],[83,0,83,1],[83,4,83,6],[84,0,84,1],[84,4,84,6],[255,0,255,1],[110,2,110,7],[108,2,108,7],[106,2,106,7],[104,2,104,7],[102,2,102,7],[72,2,72,5],[19,6,19,7],[19,8,19,9],[20,4,20,5],[23,4,23,6],[23,8,23,10],[28,4,28,5]]}
[null,null,null,null,null,null,null,null,null,{"$f":"'FLCC Instructions'!P1","v":"Rev. 6/14/24"}]
[null,null,null,null,null,null,null," = to be completed by Construction Manager"]
[null,null,null,null,null,null,null," = predetermined or automatic calculation"]
[]
[]
[]
["Exhibit B"]
[]
["PROPOSAL FOR FIXED LIMIT OF CONSTRUCTION COST (FLCC)"]
[]
["In accordance with the terms of AEC-Department Contract # ",null,null,null,{"$f":"IF(E12=\"A.Z.Shmina\",List!B1,IF('FLCC Exhibit B'!E12:G12=\"Kasco, Inc.\",List!B2,IF(E12=\"Commercial Contracting Corporation\",List!B3,IF(E12=\"Ideal Contracting LLC\",List!B4,0))))","v":0},null,"for CM Services for Small Projects"]
["between The Regents of the University of Michigan and",null,null,null,null,null,null,", dated","2023-08-01",null,"the following"]
["FLCC proposal is submitted for:"]
[]
[]
[]
["PROJECT:",null,"BUILDING NAME:"]
[null,null,"BUILDING No. "]
[null,null,"PROJECT DESCRIPTION:"]
[]
[null,null,"U-M PROJECT NO. "]
[]
[]
["Submitted via Email to:",null,null,"Design/Project Manager:",null,null,null,"Email:"]
[]
[]
[]
[]
[null,null,null,"Date Submitted:"]
[]
[]
[]
[null,"Fixed Limit of Construction Cost:",null,"Not-to-Exceed",{"$f":"IFERROR('FLCC CSI Cost Estimate Summary'!Q299:Q299,0)","v":0}]
[]
[null,null,"Submitted By: ",{"$f":"E12","v":0}]
[null,null,"Address "]
[]
[null,null,null,null,null,null,null,null," = to be completed by Contractor"]
[null,null,null,null,null,null,null,null," = predetermined or automatic calculation"]
["GENERAL DESCRIPTION OF PROJECT AND SERVICES TO BE PROVIDED:"]
["[Scope of Work]"]
[]
[]
[]
[]
[]
[]
[]
[]
[]
[]
[]
["This Project Schedule is predicated upon the release dates of the following design bid sets and shall be provided by the"]
["Design Professional (indicate if \"None Due\"):"]
[]
[null,null,null,null,null,null,null,null,"Bid Document Release"]
["Title",null,null,"Description",null,null,null,null,"Date to CM"]
[]
[]
[]
[]
[]
[]
["SCHEDULES (Part 3.7 of the Agreement For Professional Construction Management Services \"Agreement\")"]
["The Project Schedule reflects the Substantial Completion and Occupancy date for all areas of the Project is"]
[]
["The Guaranteed Maximum Price (GMP) Proposal will be submitted by this date:",null,null,null,null,null,null,null,". (Part 7 of the Agreement)"]
[]
["Additional established contract dates are:"]
["Description",null,null,null,null,null,"Dates"]
["Description",null,null,null,null,null,"Dates"]
["Description",null,null,null,null,null,"Dates"]
["Description",null,null,null,null,null,"Dates"]
["PROJECT TEAM"]
["The following Project Team will be utilized for this project and unless otherwise noted below, will be dedicated full time to the project."]
[]
["Title",null,"Name","% Effort","Explain Hours/Week/Project"]
[]
[]
[]
[]
[]
[]
[]
[]
[]
[]
["Acceptance of the above proposed team does not preclude the Construction Manager from providing the necessary personnel required for the "]
["Construction Manager to perform its services detailed in the Agreement and meeting the GMP and schedule requirements.  Therefore, if the "]
["Construction Manager requires additional personnel to perform these services, such personnel shall be added without an increase to the GMP, unless"]
["such increase in personnel is required due to circumstances detailed in Part 2.10.3.1 of the Agreement."]
[]
["In addition to any other audit rights to which it might be entitled, the Owner shall also have the right to audit the Construction Manager's books and records"]
["pertaining to the monthly lump sums charged for staff. This audit shall be for the purpose of verifying that(i) the calculation of the monthly lump sums"]
["is accurate and (ii) that the funds paid by the Owner for staff were applied by the Construction Manager as intended by the formula by which the amount "]
["of the monthly sum payments were derived."]
[]
[]
["PROPOSAL SIGNATURE"]
["The information provided herein is true and sufficiently complete so as not to be misleading."]
[]
[]
[null,"Construction Manager: ",{"$f":"E12","v":0}]
[]
[null,"Signature:"]
[]
[null,"Printed: "]
[]
[null,"Title:"]
[]
[null,"Date:"]

{"sheet":"FLCC CSI Cost Estimate Summary","index":2,"n_rows":505,"n_cols":51,"rows_kept":505,"cut":false,"hidden":false,"merged":[[2,16,2,17],[111,0,111,15],[101,0,101,15],[101,16,101,17],[92,0,95,1],[92,2,92,3],[92,6,92,7],[92,10,95,11],[92,12,95,13],[92,16,95,17],[93,2,93,3],[93,6,93,7],[94,2,94,3],[94,6,94,7],[95,2,95,3],[95,6,95,7],[96,0,96,15],[96,16,96,17],[97,6,97,7],[97,10,100,11],[97,12,100,13],[97,16,100,17],[98,2,98,3],[98,6,98,7],[502,16,502,17],[503,0,503,6],[503,7,503,10],[503,11,503,13],[503,14,503,15],[102,16,105,17],[103,2,103,3],[103,6,103,7],[104,2,104,3],[104,6,104,7],[105,2,105,3],[105,6,105,7],[106,0,106,15],[106,16,106,17],[102,0,105,1],[102,2,102,3],[102,6,102,7],[102,10,105,11],[102,12,105,13],[249,0,249,6],[249,7,249,10],[249,11,249,13],[249,14,249,15],[244,0,244,6],[504,0,504,6],[504,7,504,10],[504,11,504,13],[504,14,504,15],[111,16,111,17],[107,0,110,1],[107,2,107,3],[107,6,107,7],[107,10,110,11],[107,12,110,13],[107,16,110,17],[108,2,108,3],[108,6,108,7],[109,2,109,3],[109,6,109,7],[110,2,110,3],[110,6,110,7],[152,2,152,3],[151,0,151,1],[147,16,158,17],[147,8,158,14],[153,0,153,1],[153,2,153,3],[502,0,502,15],[97,2,97,3],[89,2,89,3],[89,6,89,7],[90,2,90,3],[90,6,90,7],[157,4,157,7],[91,0,91,15],[91,16,91,17],[82,0,85,1],[97,0,100,1],[99,2,99,3],[99,6,99,7],[100,2,100,3],[100,6,100,7],[82,2,82,3],[82,6,82,7],[82,10,85,11],[82,12,85,13],[82,16,85,17],[83,2,83,3],[83,6,83,7],[84,2,84,3],[84,6,84,7],[85,2,85,3],[66,16,66,17],[66,0,66,15],[65,6,65,7],[65,2,65,3],[64,6,64,7],[64,2,64,3],[63,6,63,7],[63,2,63,3],[62,16,65,17],[62,12,65,13],[62,10,65,11],[62,6,62,7],[62,2,62,3],[62,0,65,1],[61,16,61,17],[57,0,60,1],[57,2,57,3],[57,6,57,7],[57,10,60,11],[57,12,60,13],[57,16,60,17],[58,2,58,3],[58,6,58,7],[59,2,59,3],[59,6,59,7],[60,2,60,3],[60,6,60,7],[47,0,50,1],[47,2,47,3],[47,6,47,7],[42,0,45,1],[42,2,42,3],[42,6,42,7],[42,10,45,11],[42,12,45,13],[61,0,61,15],[49,2,49,3],[49,6,49,7],[50,2,50,3],[50,6,50,7],[47,10,50,11],[47,12,50,13],[56,0,56,15],[52,0,55,1],[52,2,52,3],[52,6,52,7],[52,10,55,11],[52,12,55,13],[37,0,40,1],[37,2,37,3],[37,6,37,7],[37,10,40,11],[37,12,40,13],[37,16,40,17],[38,2,38,3],[38,6,38,7],[39,2,39,3],[39,6,39,7],[40,2,40,3],[40,6,40,7],[42,16,45,17],[43,2,43,3],[43,6,43,7],[44,2,44,3],[44,6,44,7],[45,2,45,3],[45,6,45,7],[47,16,50,17],[48,2,48,3],[48,6,48,7],[46,16,46,17],[56,16,56,17],[21,16,21,17],[16,16,16,17],[0,0,1,17],[4,4,6,4],[51,0,51,15],[36,0,36,15],[41,0,41,15],[46,0,46,15],[21,0,21,15],[26,0,26,15],[31,0,31,15],[4,16,6,17],[4,0,6,1],[4,2,6,3],[4,6,6,7],[4,10,6,11],[4,12,6,13],[4,14,6,15],[4,5,6,5],[4,8,6,9],[17,2,17,3],[7,6,7,7],[51,16,51,17],[7,12,10,13],[17,6,17,7],[17,10,20,11],[17,12,20,13],[11,16,11,17],[146,0,146,1],[12,16,15,17],[13,2,13,3],[13,6,13,7],[14,2,14,3],[14,6,14,7],[15,2,15,3],[15,6,15,7],[27,0,30,1],[27,2,27,3],[27,6,27,7],[27,10,30,11],[27,12,30,13],[22,16,25,17],[23,2,23,3],[23,6,23,7],[24,2,24,3],[7,16,10,17],[31,16,31,17],[8,2,8,3],[17,0,20,1],[12,10,15,11],[12,12,15,13],[12,0,15,1],[16,0,16,15],[17,16,20,17],[18,2,18,3],[18,6,18,7],[19,2,19,3],[19,6,19,7],[20,2,20,3],[20,6,20,7],[8,6,8,7],[9,2,9,3],[9,6,9,7],[10,2,10,3],[10,6,10,7],[12,2,12,3],[12,6,12,7],[11,0,11,15],[7,0,10,1],[7,2,7,3],[7,10,10,11],[27,16,30,17],[28,2,28,3],[28,6,28,7],[29,2,29,3],[29,6,29,7],[30,2,30,3],[30,6,30,7],[24,6,24,7],[25,2,25,3],[25,6,25,7],[26,16,26,17],[32,0,35,1],[32,2,32,3],[32,6,32,7],[32,10,35,11],[32,12,35,13],[22,0,25,1],[22,2,22,3],[22,6,22,7],[22,10,25,11],[22,12,25,13],[32,16,35,17],[33,2,33,3],[33,6,33,7],[34,2,34,3],[34,6,34,7],[35,2,35,3],[35,6,35,7],[41,16,41,17],[36,16,36,17],[52,16,55,17],[53,2,53,3],[53,6,53,7],[54,2,54,3],[54,6,54,7],[55,2,55,3],[55,6,55,7],[171,20,171,21],[171,22,171,23],[164,0,169,19],[113,16,113,17],[148,0,148,1],[159,16,159,17],[161,16,161,17],[146,12,146,13],[149,4,149,7],[150,4,150,7],[149,0,149,1],[150,0,150,1],[146,2,146,3],[148,2,148,3],[149,2,149,3],[150,2,150,3],[151,2,151,3],[177,20,177,21],[177,22,177,23],[152,4,152,7],[175,0,175,15],[175,16,175,17],[175,20,175,21],[175,22,175,23],[172,0,173,15],[172,16,173,17],[172,20,172,21],[172,22,172,23],[173,20,173,21],[173,22,173,23],[174,0,174,15],[174,16,174,17],[174,20,174,21],[174,22,174,23],[170,20,170,21],[170,22,170,23],[176,0,176,15],[176,16,176,17],[176,20,176,21],[176,22,176,23],[157,2,157,3],[179,22,179,23],[181,0,181,15],[181,16,181,17],[180,0,180,15],[180,16,180,17],[185,0,185,15],[182,0,182,15],[184,0,184,15],[184,16,184,17],[183,0,183,15],[185,16,185,17],[178,20,178,21],[178,22,178,23],[179,0,179,15],[179,16,179,17],[179,20,179,21],[208,16,208,17],[209,0,209,15],[209,16,209,17],[204,0,204,15],[204,16,204,17],[205,0,205,15],[205,16,205,17],[206,0,206,15],[206,16,206,17],[207,0,207,15],[208,0,208,15],[199,11,199,12],[199,13,199,14],[203,16,203,17],[198,16,198,17],[199,16,199,17],[200,16,200,17],[207,16,207,17],[187,0,187,15],[244,7,244,10],[244,11,244,13],[244,14,244,15],[245,0,245,6],[245,7,245,10],[245,11,245,13],[245,14,245,15],[246,0,246,6],[246,7,246,10],[246,11,246,13],[246,14,246,15],[268,0,268,15],[268,16,268,17],[268,18,268,19],[269,0,269,15],[269,16,269,17],[269,18,269,19],[250,0,250,10],[250,11,250,13],[250,14,250,15],[265,18,265,19],[266,18,266,19],[267,0,267,15],[267,16,267,17],[267,18,267,19],[273,16,273,17],[273,18,273,19],[274,18,274,19],[278,0,278,15],[278,16,278,17],[271,0,271,15],[271,16,271,17],[271,18,271,19],[272,0,272,7],[272,10,272,15],[272,16,272,17],[272,18,272,19],[273,0,273,14],[298,16,298,17],[291,0,291,15],[291,16,291,17],[293,0,293,15],[293,16,293,17],[298,14,298,15],[298,0,298,13],[296,0,296,15],[296,16,296,17],[295,16,295,17],[295,8,295,15],[292,0,292,15],[292,16,292,17],[294,16,294,17],[282,0,282,14],[282,16,282,17],[284,16,284,17],[289,0,289,15],[289,16,289,17],[290,0,290,15],[290,16,290,17],[279,0,279,15],[279,16,279,17],[280,0,280,15],[280,16,280,17],[281,0,281,7],[281,10,281,15],[281,16,281,17],[248,18,248,19],[247,0,247,6],[247,7,247,10],[247,11,247,13],[247,14,247,15],[183,16,183,17],[182,16,182,17],[243,11,243,13],[243,14,243,15],[239,0,240,6],[239,7,240,10],[239,11,240,13],[239,14,240,15],[241,0,241,6],[241,7,241,10],[243,7,243,10],[222,11,222,13],[222,14,222,15],[225,0,225,6],[225,7,225,10],[225,11,225,13],[225,14,225,15],[222,0,222,6],[222,7,222,10],[219,0,219,6],[219,7,219,10],[219,11,219,13],[223,0,223,6],[223,7,223,10],[223,11,223,13],[223,14,223,15],[220,0,220,6],[220,7,220,10],[242,0,242,6],[242,7,242,10],[242,11,242,13],[242,14,242,15],[241,11,241,13],[241,14,241,15],[220,11,220,13],[220,14,220,15],[221,0,221,6],[221,7,221,10],[221,11,221,13],[221,14,221,15],[158,0,158,1],[158,2,158,3],[158,4,158,7],[147,0,147,1],[147,2,147,3],[147,4,147,7],[154,0,154,1],[154,2,154,3],[154,4,154,7],[155,0,155,1],[155,2,155,3],[155,4,155,7],[156,0,156,1],[156,2,156,3],[156,4,156,7],[152,0,152,1],[148,4,148,7],[151,4,151,7],[157,0,157,1],[85,6,85,7],[86,0,86,15],[86,16,86,17],[87,0,90,1],[87,2,87,3],[87,6,87,7],[87,10,90,11],[87,12,90,13],[87,16,90,17],[88,2,88,3],[88,6,88,7],[77,0,80,1],[77,2,77,3],[77,6,77,7],[77,10,80,11],[77,12,80,13],[77,16,80,17],[78,2,78,3],[78,6,78,7],[79,2,79,3],[79,6,79,7],[80,2,80,3],[80,6,80,7],[72,16,75,17],[73,2,73,3],[73,6,73,7],[74,2,74,3],[74,6,74,7],[75,2,75,3],[75,6,75,7],[76,0,76,15],[76,16,76,17],[71,0,71,15],[71,16,71,17],[198,0,198,14],[200,0,200,14],[284,14,284,15],[67,0,70,1],[67,2,67,3],[67,6,67,7],[67,10,70,11],[67,12,70,13],[67,16,70,17],[68,2,68,3],[68,6,68,7],[69,2,69,3],[69,6,69,7],[70,2,70,3],[70,6,70,7],[81,0,81,15],[81,16,81,17],[72,0,75,1],[72,2,72,3],[72,6,72,7],[72,10,75,11],[72,12,75,13],[218,7,218,10],[218,11,218,13],[218,14,218,15],[113,11,113,14],[178,0,178,15],[178,16,178,17],[187,16,187,17],[197,0,197,14],[197,16,197,17],[203,0,203,15],[201,0,201,15],[201,16,201,17],[202,0,202,15],[202,16,202,17],[177,16,177,17],[131,0,131,1],[131,2,131,3],[131,6,131,7],[131,8,131,9],[131,10,131,11],[131,12,131,13],[131,14,131,15],[177,0,177,15],[131,16,131,17],[270,16,270,17],[135,2,135,3],[135,6,135,7],[134,2,134,3],[134,6,134,7],[140,2,140,3],[140,6,140,7],[132,2,132,3],[132,6,132,7],[133,2,133,3],[133,6,133,7],[143,16,143,17],[153,4,153,7],[243,0,243,6],[219,14,219,15],[215,0,216,6],[215,7,216,10],[215,11,216,13],[215,14,216,15],[217,0,217,6],[217,7,217,10],[217,11,217,13],[217,14,217,15],[218,0,218,6],[146,16,146,17],[146,4,146,7],[132,0,135,1],[132,10,135,11],[132,12,135,13],[132,16,135,17],[137,0,140,1],[137,10,140,11],[137,12,140,13],[137,16,140,17],[141,0,141,15],[141,16,141,17],[137,2,137,3],[137,6,137,7],[138,2,138,3],[138,6,138,7],[139,2,139,3],[139,6,139,7],[136,0,136,15],[136,16,136,17]]}
["Trade Contractor Bid Summary - All proposals received from the Trade Contractors must follow this document in the same sequential order as noted on the following including any and all bid declinations.",null,null,null,null,null,null,null,null,null,null,null,null,null,null,null,null,null,"False",null,null,null,null,null,null,null,null,null,null,null,null,null,null,null,null,null,null,null,null,null,null,null,null,null,null,null,"Decline Bid"]
[null,null,null,null,null,null,null,null,null,null,null,null,null,null,null,null,null,null,null,null,null,null,null,null,null,null,null,null,null,null,null,null,null,null,null,null,null,null,null,null,null,null,null,null,null,null,"No Response"]
[null,null,null,null,null,null,null,null,null,null,null,null," = to be completed by Construction Manager",null,null,null,{"$f":"'FLCC Instructions'!P1","v":"Rev. 6/14/24"}]
["B.1 CSI Cost Estimate",null,null,null,null,null,null,null,null,null,null,null," = predetermined or automatic calculation"]
["Scope/Trade\n(Includes CSI #'s for clarity)",null,"Proposed Trade Contractor/Self Perform/TBD",null,"Self Perform","Decline Bid or No Response","Proposed Amounts \n(low to high)",null,"Estimate",null,"Selected Firm",null,"EMR",null,"Intended Awardee Proposal Detail  & (accepted alternates only)",null,"Total",null,null,true]
[]
[null,null,null,null,false,null,null,null,null,null,null,null,null,null,null,null,null,null,null,null,null,null,null,null,null,null,null,null,null,null,null,null,null,null,null,null,null,null,null,null,null,null,null,null,null,null,null,null,null,"*"]
[null,null,"Name",null,false,null,0,null,false,false,{"$f":"C8","v":"Name"},null,null,null,"Base Bid",0,{"$f":"IF(S8=$S$1,SUM(P8:P11),0)","v":0},null,{"$f":"IF(E8,\"True\",\"False\")","v":"False"},{"$f":"IF($S8=\"true\",A8,\"\")","v":""},{"$f":"IF($S8=\"true\",C8,\"\")","v":""},{"$f":"IF($S8=\"true\",E8,\"\")","v":""},{"$f":"IF($S8=\"true\",\"A\",\"\")","v":""},{"$f":"IF($S8=\"true\",\"A\",\"\")","v":""},{"$f":"IF($S8=\"true\",G8,\"\")","v":""},{"$f":"IF($S8=\"true\",\"A\",\"\")","v":""},{"$f":"IF($S8=\"true\",\"A\",\"\")","v":""},{"$f":"IF($S8=\"true\",\"A\",\"\")","v":""},{"$f":"IF($S8=\"true\",K8,\"\")","v":""},{"$f":"IF($S8=\"true\",M8,\"\")","v":""},{"$f":"IF($S8=\"true\",P8,\"\")","v":""},{"$f":"IF($S8=\"true\",P9,\"\")","v":""},{"$f":"IF($S8=\"true\",P10,\"\")","v":""},{"$f":"IF($S8=\"true\",P11,\"\")","v":""},{"$f":"IF($S8=\"true\",#REF!,\"\")","v":""},{"$f":"IF($S8=\"true\",SUM(P8:P11),\"\")","v":""}]
[null,null,"Name",null,false,null,0,null,false,null,null,null,null,null,"Alternate",0,null,null,{"$f":"IF(E9,\"True\",\"False\")","v":"False"},{"$f":"IF($S9=\"true\",A9,\"\")","v":""},{"$f":"IF($S9=\"true\",C9,\"\")","v":""},{"$f":"IF($S9=\"true\",E9,\"\")","v":""},{"$f":"IF($S9=\"true\",\"A\",\"\")","v":""},"",{"$f":"IF($S9=\"true\",G9,\"\")","v":""},{"$f":"IF($S9=\"true\",\"A\",\"\")","v":""},"","",{"$f":"IF($S9=\"true\",K9,\"\")","v":""},"","","","","",{"$f":"IF($S9=\"true\",#REF!,\"\")","v":""},{"$f":"IF($S9=\"true\",SUM(P9:P12),\"\")","v":""}]
[null,null,"Name",null,false,null,0,null,false,null,null,null,null,null,"Alternate",0,null,null,"False","","","","","","","","","","","","","","","",{"$f":"IF($S10=\"true\",#REF!,\"\")","v":""},""]
[null,null,"Name",null,false,null,0,null,false,null,null,null,null,null,"Alternate",0,null,null,"False","","","","","","","","","","","","","","","",{"$f":"IF($S11=\"true\",#REF!,\"\")","v":""},""]
["Contractor Scope/Trade Detail:",null,null,null,null,null,null,null,null,null,null,null,null,null,null,null,"AEC PM Approval:",null,"False","","","","","","","","","","","","","","","",{"$f":"IF($S12=\"true\",#REF!,\"\")","v":""},""]
[null,null,"Name",null,false,null,0,null,false,false,{"$f":"C13","v":"Name"},null,null,null,"Base Bid",0,{"$f":"IF(S13=$S$1,SUM(P13:P16),0)","v":0},null,"False","","","","","","","","","","","","","","","",{"$f":"IF($S13=\"true\",#REF!,\"\")","v":""},""]
[null,null,"Name",null,false,null,0,null,false,null,null,null,null,null,"Alternate",0,null,null,"False","","","","","","","","","","","","","","","",{"$f":"IF($S14=\"true\",#REF!,\"\")","v":""},""]
[null,null,"Name",null,false,null,0,null,null,null,null,null,null,null,"Alternate",0,null,null,"False","","","","","","","","","","","","","","","",{"$f":"IF($S15=\"true\",#REF!,\"\")","v":""},""]
[null,null,"Name",null,false,null,0,null,null,null,null,null,null,null,"Alternate",0,null,null,"False","","","","","","","","","","","","","","","",{"$f":"IF($S16=\"true\",#REF!,\"\")","v":""},""]
["Contractor Scope/Trade Detail:",null,null,null,null,null,null,null,null,null,null,null,null,null,null,null,"AEC PM Approval:",null,"False","","","","","","","","","","","","","","","",{"$f":"IF($S17=\"true\",#REF!,\"\")","v":""},""]
[null,null,"Name",null,false,null,0,null,false,false,{"$f":"C18","v":"Name"},null,null,null,"Base Bid",0,{"$f":"IF(S18=$S$1,SUM(P18:P21),0)","v":0},null,"False","","","","","","","","","","","","","","","",{"$f":"IF($S18=\"true\",#REF!,\"\")","v":""},""]
[null,null,"Name",null,false,null,0,null,false,false,null,null,null,null,"Alternate",0,null,null,"False","","","","","","","","","","","","","","","",{"$f":"IF($S19=\"true\",#REF!,\"\")","v":""},""]
[null,null,"Name",null,false,null,0,null,null,false,null,null,null,null,"Alternate",0,null,null,"False","","","","","","","","","","","","","","","",{"$f":"IF($S20=\"true\",#REF!,\"\")","v":""},""]
[null,null,"Name",null,false,null,0,null,null,false,null,null,null,null,"Alternate",0,null,null,"False","","","","","","","","","","","","","","","",{"$f":"IF($S21=\"true\",#REF!,\"\")","v":""},""]
["Contractor Scope/Trade Detail:",null,null,null,null,null,null,null,null,null,null,null,null,null,null,null,"AEC PM Approval:",null,"False","","","","","","","","","","","","","","","",{"$f":"IF($S22=\"true\",#REF!,\"\")","v":""},""]
[null,null,"Name",null,false,null,0,null,null,false,{"$f":"C23","v":"Name"},null,null,null,"Base Bid",0,{"$f":"IF(S23=$S$1,SUM(P23:P26),0)","v":0},null,"False","","","","","","","","","","","","","","","",{"$f":"IF($S23=\"true\",#REF!,\"\")","v":""},""]
[null,null,"Name",null,false,null,0,null,false,null,null,null,null,null,"Alternate",0,null,null,"False","","","","","","","","","","","","","","","",{"$f":"IF($S24=\"true\",#REF!,\"\")","v":""},""]
[null,null,"Name",null,false,null,0,null,null,null,null,null,null,null,"Alternate",0,null,null,"False","","","","","","","","","","","","","","","",{"$f":"IF($S25=\"true\",#REF!,\"\")","v":""},""]
[null,null,"Name",null,false,null,0,null,null,null,null,null,null,null,"Alternate",0,null,null,"False","","","","","","","","","","","","","","","",{"$f":"IF($S26=\"true\",#REF!,\"\")","v":""},""]
["Contractor Scope/Trade Detail:",null,null,null,null,null,null,null,null,null,null,null,null,null,null,null,"AEC PM Approval:",null,"False","","","","","","","","","","","","","","","",{"$f":"IF($S27=\"true\",#REF!,\"\")","v":""},""]
[null,null,"Name",null,null,null,0,null,null,null,{"$f":"C28","v":"Name"},null,null,null,"Base Bid",0,{"$f":"IF(S28=$S$1,SUM(P28:P31),0)","v":0},null,"False","","","","","","","","","","","","","","","",{"$f":"IF($S28=\"true\",#REF!,\"\")","v":""},""]
[null,null,"Name",null,false,null,0,null,false,null,null,null,null,null,"Alternate",0,null,null,"False","","","","","","","","","","","","","","","",{"$f":"IF($S29=\"true\",#REF!,\"\")","v":""},""]
[null,null,"Name",null,false,null,0,null,null,null,null,null,null,null,"Alternate",0,null,null,"False","","","","","","","","","","","","","","","",{"$f":"IF($S30=\"true\",#REF!,\"\")","v":""},""]
[null,null,"Name",null,false,null,0,null,null,null,null,null,null,null,"Alternate",0,null,null,"False","","","","","","","","","","","","","","","",{"$f":"IF($S31=\"true\",#REF!,\"\")","v":""},""]
["Contractor Scope/Trade Detail:",null,null,null,null,null,null,null,null,null,null,null,null,null,null,null,"AEC PM Approval:",null,"False","","","","","","","","","","","","","","","",{"$f":"IF($S32=\"true\",#REF!,\"\")","v":""},""]
[null,null,"Name",null,false,null,0,null,null,null,{"$f":"C33","v":"Name"},null,null,null,"Base Bid",0,{"$f":"IF(S33=$S$1,SUM(P33:P36),0)","v":0},null,"False","","","","","","","","","","","","","","","",{"$f":"IF($S33=\"true\",#REF!,\"\")","v":""},""]
[null,null,"Name",null,false,null,0,null,false,null,null,null,null,null,"Alternate",0,null,null,"False","","","","","","","","","","","","","","","",{"$f":"IF($S34=\"true\",#REF!,\"\")","v":""},""]
[null,null,"Name",null,false,null,0,null,null,null,null,null,null,null,"Alternate",0,null,null,"False","","","","","","","","","","","","","","","",{"$f":"IF($S35=\"true\",#REF!,\"\")","v":""},""]
[null,null,"Name",null,false,null,0,null,null,null,null,null,null,null,"Alternate",0,null,null,"False","","","","","","","","","","","","","","","",{"$f":"IF($S36=\"true\",#REF!,\"\")","v":""},""]
["Contractor Scope/Trade Detail:",null,null,null,null,null,null,null,null,null,null,null,null,null,null,null,"AEC PM Approval:",null,"False","","","","","","","","","","","","","","","",{"$f":"IF($S37=\"true\",#REF!,\"\")","v":""},""]
[null,null,"Name",null,false,null,0,null,null,null,{"$f":"C38","v":"Name"},null,null,null,"Base Bid",0,{"$f":"IF(S38=$S$1,SUM(P38:P41),0)","v":0},null,"False","","","","","","","","","","","","","","","",{"$f":"IF($S38=\"true\",#REF!,\"\")","v":""},""]
[null,null,"Name",null,false,null,0,null,false,null,null,null,null,null,"Alternate",0,null,null,"False","","","","","","","","","","","","","","","",{"$f":"IF($S39=\"true\",#REF!,\"\")","v":""},""]
[null,null,"Name",null,false,null,0,null,null,null,null,null,null,null,"Alternate",0,null,null,"False","","","","","","","","","","",{"$f":"IF($S40=\"true\",M40,\"\")","v":""},{"$f":"IF($S40=\"true\",P40,\"\")","v":""},{"$f":"IF($S40=\"true\",P41,\"\")","v":""},{"$f":"IF($S40=\"true\",P42,\"\")","v":""},{"$f":"IF($S40=\"true\",P43,\"\")","v":""},{"$f":"IF($S40=\"true\",#REF!,\"\")","v":""},""]
[null,null,"Name",null,false,null,0,null,null,null,null,null,null,null,"Alternate",0,null,null,"False","","","",{"$f":"IF($S41=\"true\",\"A\",\"\")","v":""},"","",{"$f":"IF($S41=\"true\",\"A\",\"\")","v":""},"","","","","","","","",{"$f":"IF($S41=\"true\",#REF!,\"\")","v":""},""]
["Contractor Scope/Trade Detail:",null,null,null,null,null,null,null,null,null,null,null,null,null,null,null,"AEC PM Approval:",null,"False","","","","","","","","","","","","","","","",{"$f":"IF($S42=\"true\",#REF!,\"\")","v":""},""]
[null,null,"Name",null,false,null,0,null,false,null,{"$f":"C43","v":"Name"},null,null,null,"Base Bid",0,{"$f":"IF(S43=$S$1,SUM(P43:P46),0)","v":0},null,"False","","","","","","","","","","","","","","","",{"$f":"IF($S43=\"true\",#REF!,\"\")","v":""},""]
[null,null,"Name",null,false,null,0,null,false,null,null,null,null,null,"Alternate",0,null,null,"False","","","","","","","","","","","","","","","",{"$f":"IF($S44=\"true\",#REF!,\"\")","v":""},""]
[null,null,"Name",null,false,null,0,null,false,null,null,null,null,null,"Alternate",0,null,null,"False","","","","","","","","","","","","","","","",{"$f":"IF($S45=\"true\",#REF!,\"\")","v":""},""]
[null,null,"Name",null,false,null,0,null,false,null,null,null,null,null,"Alternate",0,null,null,"False","","","","","","","","","","","","","","","",{"$f":"IF($S46=\"true\",#REF!,\"\")","v":""},""]
["Contractor Scope/Trade Detail:",null,null,null,null,null,null,null,null,null,null,null,null,null,null,null,"AEC PM Approval:",null,"False","","","","","","","","","","","","","","","",{"$f":"IF($S47=\"true\",#REF!,\"\")","v":""},""]
[null,null,"Name",null,false,null,0,null,null,null,{"$f":"C48","v":"Name"},null,null,null,"Base Bid",0,{"$f":"IF(S48=$S$1,SUM(P48:P51),0)","v":0},null,"False","","","","","","","","","","","","","","","",{"$f":"IF($S48=\"true\",#REF!,\"\")","v":""},""]
[null,null,"Name",null,false,null,0,null,false,null,null,null,null,null,"Alternate",0,null,null,"False","","","","","","","","","","","","","","","",{"$f":"IF($S49=\"true\",#REF!,\"\")","v":""},""]
[null,null,"Name",null,false,null,0,null,false,null,null,null,null,null,"Alternate",0,null,null,"False","","","","","","","","","","","","","","",{"$f":"IF($S50=\"true\",#REF!,\"\")","v":""},{"$f":"IF($S50=\"true\",#REF!,\"\")","v":""},""]
[null,null,"Name",null,false,null,0,null,false,null,null,null,null,null,"Alternate",0,null,null,"False","","","","","","","","","","","","","",{"$f":"IF($S51=\"true\",#REF!,\"\")","v":""},{"$f":"IF($S51=\"true\",#REF!,\"\")","v":""},{"$f":"IF($S51=\"true\",#REF!,\"\")","v":""},""]
["Contractor Scope/Trade Detail:",null,null,null,null,null,null,null,null,null,null,null,null,null,null,null,"AEC PM Approval:",null,"False","","","","","","","","","","","","",{"$f":"IF($S52=\"true\",#REF!,\"\")","v":""},{"$f":"IF($S52=\"true\",#REF!,\"\")","v":""},{"$f":"IF($S52=\"true\",#REF!,\"\")","v":""},{"$f":"IF($S52=\"true\",#REF!,\"\")","v":""},""]
[null,null,"Name",null,false,null,0,null,null,null,{"$f":"C53","v":"Name"},null,null,null,"Base Bid",0,{"$f":"IF(S53=$S$1,SUM(P53:P56),0)","v":0},null,"False","","","","","","","","","","",{"$f":"IF($S53=\"true\",M53,\"\")","v":""},{"$f":"IF($S53=\"true\",P53,\"\")","v":""},{"$f":"IF($S53=\"true\",P54,\"\")","v":""},{"$f":"IF($S53=\"true\",P55,\"\")","v":""},{"$f":"IF($S53=\"true\",P56,\"\")","v":""},{"$f":"IF($S53=\"true\",#REF!,\"\")","v":""},""]
[null,null,"Name",null,false,null,0,null,false,null,null,null,null,null,"Alternate",0,null,null,"False","","","","","","","","","","",{"$f":"IF($S54=\"true\",M54,\"\")","v":""},{"$f":"IF($S54=\"true\",P54,\"\")","v":""},{"$f":"IF($S54=\"true\",P55,\"\")","v":""},{"$f":"IF($S54=\"true\",P56,\"\")","v":""},{"$f":"IF($S54=\"true\",P57,\"\")","v":""},{"$f":"IF($S54=\"true\",#REF!,\"\")","v":""},""]
[null,null,"Name",null,false,null,0,null,false,null,null,null,null,null,"Alternate",0,null,null,"False","","","","","","","","","","",{"$f":"IF($S55=\"true\",M55,\"\")","v":""},{"$f":"IF($S55=\"true\",P55,\"\")","v":""},{"$f":"IF($S55=\"true\",P56,\"\")","v":""},{"$f":"IF($S55=\"true\",P57,\"\")","v":""},{"$f":"IF($S55=\"true\",#REF!,\"\")","v":""},{"$f":"IF($S55=\"true\",#REF!,\"\")","v":""},""]
[null,null,"Name",null,false,null,0,null,null,null,null,null,null,null,"Alternate",0,null,null,"False","","","","","","","","","","",{"$f":"IF($S56=\"true\",M56,\"\")","v":""},{"$f":"IF($S56=\"true\",P56,\"\")","v":""},{"$f":"IF($S56=\"true\",P57,\"\")","v":""},{"$f":"IF($S56=\"true\",#REF!,\"\")","v":""},{"$f":"IF($S56=\"true\",#REF!,\"\")","v":""},{"$f":"IF($S56=\"true\",#REF!,\"\")","v":""},""]
["Contractor Scope/Trade Detail:",null,null,null,null,null,null,null,null,null,null,null,null,null,null,null,"AEC PM Approval:",null,"False","","","","","","","","","","",null,null,null,null,null,null,""]
[null,null,"Name",null,false,null,0,null,null,null,{"$f":"C58","v":"Name"},null,null,null,"Base Bid",0,{"$f":"IF(S58=$S$1,SUM(P58:P61),0)","v":0},null,"False","","","","","","","","","","",{"$f":"IF($S58=\"true\",M58,\"\")","v":""},{"$f":"IF($S58=\"true\",P58,\"\")","v":""},{"$f":"IF($S58=\"true\",P59,\"\")","v":""},{"$f":"IF($S58=\"true\",P60,\"\")","v":""},{"$f":"IF($S58=\"true\",P61,\"\")","v":""},{"$f":"IF($S58=\"true\",#REF!,\"\")","v":""},""]
[null,null,"Name",null,false,null,0,null,false,null,null,null,null,null,"Alternate",0,null,null,"False","","","","","","","","","","",{"$f":"IF($S59=\"true\",M59,\"\")","v":""},{"$f":"IF($S59=\"true\",P59,\"\")","v":""},{"$f":"IF($S59=\"true\",P60,\"\")","v":""},{"$f":"IF($S59=\"true\",P61,\"\")","v":""},{"$f":"IF($S59=\"true\",P62,\"\")","v":""},{"$f":"IF($S59=\"true\",#REF!,\"\")","v":""},""]
[null,null,"Name",null,false,null,0,null,false,null,null,null,null,null,"Alternate",0,null,null,"False","","","","","","","","","","",{"$f":"IF($S60=\"true\",M60,\"\")","v":""},{"$f":"IF($S60=\"true\",P60,\"\")","v":""},{"$f":"IF($S60=\"true\",P61,\"\")","v":""},{"$f":"IF($S60=\"true\",P62,\"\")","v":""},{"$f":"IF($S60=\"true\",#REF!,\"\")","v":""},{"$f":"IF($S60=\"true\",#REF!,\"\")","v":""},""]
[null,null,"Name",null,false,null,0,null,null,null,null,null,null,null,"Alternate",0,null,null,"False","","","","","","","","","","",{"$f":"IF($S61=\"true\",M61,\"\")","v":""},{"$f":"IF($S61=\"true\",P61,\"\")","v":""},{"$f":"IF($S61=\"true\",P62,\"\")","v":""},{"$f":"IF($S61=\"true\",#REF!,\"\")","v":""},{"$f":"IF($S61=\"true\",#REF!,\"\")","v":""},{"$f":"IF($S61=\"true\",#REF!,\"\")","v":""},""]
["Contractor Scope/Trade Detail:",null,null,null,null,null,null,null,null,null,null,null,null,null,null,null,"AEC PM Approval:",null,"False","","","","","","","","","","",null,null,null,null,null,null,""]
[null,null,"Name",null,false,null,0,null,null,null,{"$f":"C63","v":"Name"},null,null,null,"Base Bid",0,{"$f":"IF(S63=$S$1,SUM(P63:P66),0)","v":0},null,"False","","","","","","","","","","",{"$f":"IF($S63=\"true\",M63,\"\")","v":""},{"$f":"IF($S63=\"true\",P63,\"\")","v":""},{"$f":"IF($S63=\"true\",P64,\"\")","v":""},{"$f":"IF($S63=\"true\",P65,\"\")","v":""},{"$f":"IF($S63=\"true\",P66,\"\")","v":""},{"$f":"IF($S63=\"true\",#REF!,\"\")","v":""},""]
[null,null,"Name",null,false,null,0,null,false,null,null,null,null,null,"Alternate",0,null,null,"False","","","","","","","","","","",{"$f":"IF($S64=\"true\",M64,\"\")","v":""},{"$f":"IF($S64=\"true\",P64,\"\")","v":""},{"$f":"IF($S64=\"true\",P65,\"\")","v":""},{"$f":"IF($S64=\"true\",P66,\"\")","v":""},{"$f":"IF($S64=\"true\",P67,\"\")","v":""},{"$f":"IF($S64=\"true\",#REF!,\"\")","v":""},""]
[null,null,"Name",null,false,null,0,null,false,false,null,null,null,null,"Alternate",0,null,null,"False","","","","","","","","","","",{"$f":"IF($S65=\"true\",M65,\"\")","v":""},{"$f":"IF($S65=\"true\",P65,\"\")","v":""},{"$f":"IF($S65=\"true\",P66,\"\")","v":""},{"$f":"IF($S65=\"true\",P67,\"\")","v":""},{"$f":"IF($S65=\"true\",#REF!,\"\")","v":""},{"$f":"IF($S65=\"true\",#REF!,\"\")","v":""},{"$f":"IF($S65=\"true\",SUM(P65:P103),\"\")","v":""}]
[null,null,"Name",null,false,null,0,null,null,null,null,null,null,null,"Alternate",0,null,null,"False","","","","","","","","","","",{"$f":"IF($S66=\"true\",M66,\"\")","v":""},{"$f":"IF($S66=\"true\",P66,\"\")","v":""},{"$f":"IF($S66=\"true\",P67,\"\")","v":""},{"$f":"IF($S66=\"true\",#REF!,\"\")","v":""},{"$f":"IF($S66=\"true\",#REF!,\"\")","v":""},{"$f":"IF($S66=\"true\",#REF!,\"\")","v":""},{"$f":"IF($S66=\"true\",SUM(P66:P104),\"\")","v":""}]
["Contractor Scope/Trade Detail:",null,null,null,null,null,null,null,null,null,null,null,null,null,null,null,"AEC PM Approval:",null,"False","","","","","","","","","","",null,null,null,null,null,null,{"$f":"IF($S67=\"true\",SUM(P67:P105),\"\")","v":""}]
[null,null,"Name",null,false,null,0,null,null,null,{"$f":"C68","v":"Name"},null,null,null,"Base Bid",0,{"$f":"IF(S68=$S$1,SUM(P68:P71),0)","v":0},null,{"$f":"IF(E68,\"True\",\"False\")","v":"False"},{"$f":"IF($S68=\"true\",A68,\"\")","v":""},{"$f":"IF($S68=\"true\",C68,\"\")","v":""},{"$f":"IF($S68=\"true\",E68,\"\")","v":""},"","",{"$f":"IF($S68=\"true\",G68,\"\")","v":""},"","","",{"$f":"IF($S68=\"true\",K68,\"\")","v":""},{"$f":"IF($S68=\"true\",M68,\"\")","v":""},{"$f":"IF($S68=\"true\",P68,\"\")","v":""},{"$f":"IF($S68=\"true\",P69,\"\")","v":""},{"$f":"IF($S68=\"true\",P70,\"\")","v":""},{"$f":"IF($S68=\"true\",P71,\"\")","v":""},{"$f":"IF($S68=\"true\",#REF!,\"\")","v":""},{"$f":"IF($S68=\"true\",SUM(P68:P71),\"\")","v":""}]
[null,null,"Name",null,false,null,0,null,false,null,null,null,null,null,"Alternate",0,null,null,"False","","","","","","","","","","",{"$f":"IF($S69=\"true\",M69,\"\")","v":""},{"$f":"IF($S69=\"true\",P69,\"\")","v":""},{"$f":"IF($S69=\"true\",P70,\"\")","v":""},{"$f":"IF($S69=\"true\",P71,\"\")","v":""},{"$f":"IF($S69=\"true\",P72,\"\")","v":""},{"$f":"IF($S69=\"true\",#REF!,\"\")","v":""},{"$f":"IF($S69=\"true\",SUM(P69:P72),\"\")","v":""}]
[null,null,"Name",null,false,null,0,null,false,false,null,null,null,null,"Alternate",0,null,null,"False","","","","","","","","","","",{"$f":"IF($S70=\"true\",M70,\"\")","v":""},{"$f":"IF($S70=\"true\",P70,\"\")","v":""},{"$f":"IF($S70=\"true\",P71,\"\")","v":""},{"$f":"IF($S70=\"true\",P72,\"\")","v":""},{"$f":"IF($S70=\"true\",#REF!,\"\")","v":""},{"$f":"IF($S70=\"true\",#REF!,\"\")","v":""},{"$f":"IF($S70=\"true\",SUM(P70:P108),\"\")","v":""}]
[null,null,"Name",null,false,null,0,null,null,null,null,null,null,null,"Alternate",0,null,null,"False","","","","","","","","","","",{"$f":"IF($S71=\"true\",M71,\"\")","v":""},{"$f":"IF($S71=\"true\",P71,\"\")","v":""},{"$f":"IF($S71=\"true\",P72,\"\")","v":""},{"$f":"IF($S71=\"true\",#REF!,\"\")","v":""},{"$f":"IF($S71=\"true\",#REF!,\"\")","v":""},{"$f":"IF($S71=\"true\",#REF!,\"\")","v":""},{"$f":"IF($S71=\"true\",SUM(P71:P109),\"\")","v":""}]
["Contractor Scope/Trade Detail:",null,null,null,null,null,null,null,null,null,null,null,null,null,null,null,"AEC PM Approval:",null,"False","","","","","","","","","","",null,null,null,null,null,null,{"$f":"IF($S72=\"true\",SUM(P72:P110),\"\")","v":""}]
[null,null,"Name",null,false,null,0,null,null,null,{"$f":"C73","v":"Name"},null,null,null,"Base Bid",0,{"$f":"IF(S73=$S$1,SUM(P73:P76),0)","v":0},null,"False","","","","","","","","","","",{"$f":"IF($S73=\"true\",M73,\"\")","v":""},{"$f":"IF($S73=\"true\",P73,\"\")","v":""},{"$f":"IF($S73=\"true\",P74,\"\")","v":""},{"$f":"IF($S73=\"true\",P75,\"\")","v":""},{"$f":"IF($S73=\"true\",P76,\"\")","v":""},{"$f":"IF($S73=\"true\",#REF!,\"\")","v":""},{"$f":"IF($S73=\"true\",SUM(P73:P76),\"\")","v":""}]
[null,null,"Name",null,false,null,0,null,false,null,null,null,null,null,"Alternate",0,null,null,"False","","","","","","","","","","",{"$f":"IF($S74=\"true\",M74,\"\")","v":""},{"$f":"IF($S74=\"true\",P74,\"\")","v":""},{"$f":"IF($S74=\"true\",P75,\"\")","v":""},{"$f":"IF($S74=\"true\",P76,\"\")","v":""},{"$f":"IF($S74=\"true\",P77,\"\")","v":""},{"$f":"IF($S74=\"true\",#REF!,\"\")","v":""},{"$f":"IF($S74=\"true\",SUM(P74:P77),\"\")","v":""}]
[null,null,"Name",null,false,null,0,null,false,false,null,null,null,null,"Alternate",0,null,null,"False","","","","","","","","","","",{"$f":"IF($S75=\"true\",M75,\"\")","v":""},{"$f":"IF($S75=\"true\",P75,\"\")","v":""},{"$f":"IF($S75=\"true\",P76,\"\")","v":""},{"$f":"IF($S75=\"true\",P77,\"\")","v":""},{"$f":"IF($S75=\"true\",#REF!,\"\")","v":""},{"$f":"IF($S75=\"true\",#REF!,\"\")","v":""},{"$f":"IF($S75=\"true\",SUM(P75:P108),\"\")","v":""}]
[null,null,"Name",null,false,null,0,null,null,null,null,null,null,null,"Alternate",0,null,null,"False","","","","","","","","","","",{"$f":"IF($S76=\"true\",M76,\"\")","v":""},{"$f":"IF($S76=\"true\",P76,\"\")","v":""},{"$f":"IF($S76=\"true\",P77,\"\")","v":""},{"$f":"IF($S76=\"true\",#REF!,\"\")","v":""},{"$f":"IF($S76=\"true\",#REF!,\"\")","v":""},{"$f":"IF($S76=\"true\",#REF!,\"\")","v":""},{"$f":"IF($S76=\"true\",SUM(P76:P109),\"\")","v":""}]
["Contractor Scope/Trade Detail:",null,null,null,null,null,null,null,null,null,null,null,null,null,null,null,"AEC PM Approval:",null,"False","","","","","","","","","","",null,null,null,null,null,null,{"$f":"IF($S77=\"true\",SUM(P77:P110),\"\")","v":""}]
[null,null,"Name",null,false,null,0,null,null,null,{"$f":"C78","v":"Name"},null,null,null,"Base Bid",0,{"$f":"IF(S78=$S$1,SUM(P78:P81),0)","v":0},null,"False","","","","","","","","","","",{"$f":"IF($S78=\"true\",M78,\"\")","v":""},{"$f":"IF($S78=\"true\",P78,\"\")","v":""},{"$f":"IF($S78=\"true\",P79,\"\")","v":""},{"$f":"IF($S78=\"true\",P80,\"\")","v":""},{"$f":"IF($S78=\"true\",P81,\"\")","v":""},{"$f":"IF($S78=\"true\",#REF!,\"\")","v":""},{"$f":"IF($S78=\"true\",SUM(P78:P81),\"\")","v":""}]
[null,null,"Name",null,false,null,0,null,false,null,null,null,null,null,"Alternate",0,null,null,"False","","","","","","","","","","",{"$f":"IF($S79=\"true\",M79,\"\")","v":""},{"$f":"IF($S79=\"true\",P79,\"\")","v":""},{"$f":"IF($S79=\"true\",P80,\"\")","v":""},{"$f":"IF($S79=\"true\",P81,\"\")","v":""},{"$f":"IF($S79=\"true\",P82,\"\")","v":""},{"$f":"IF($S79=\"true\",#REF!,\"\")","v":""},{"$f":"IF($S79=\"true\",SUM(P79:P82),\"\")","v":""}]
[null,null,"Name",null,false,null,0,null,false,false,null,null,null,null,"Alternate",0,null,null,"False","","","","","","","","","","",{"$f":"IF($S80=\"true\",M80,\"\")","v":""},{"$f":"IF($S80=\"true\",P80,\"\")","v":""},{"$f":"IF($S80=\"true\",P81,\"\")","v":""},{"$f":"IF($S80=\"true\",P82,\"\")","v":""},{"$f":"IF($S80=\"true\",#REF!,\"\")","v":""},{"$f":"IF($S80=\"true\",#REF!,\"\")","v":""},{"$f":"IF($S80=\"true\",SUM(P80:P108),\"\")","v":""}]
[null,null,"Name",null,false,null,0,null,null,null,null,null,null,null,"Alternate",0,null,null,"False","","","","","","","","","","",{"$f":"IF($S81=\"true\",M81,\"\")","v":""},{"$f":"IF($S81=\"true\",P81,\"\")","v":""},{"$f":"IF($S81=\"true\",P82,\"\")","v":""},{"$f":"IF($S81=\"true\",#REF!,\"\")","v":""},{"$f":"IF($S81=\"true\",#REF!,\"\")","v":""},{"$f":"IF($S81=\"true\",#REF!,\"\")","v":""},{"$f":"IF($S81=\"true\",SUM(P81:P109),\"\")","v":""}]
["Contractor Scope/Trade Detail:",null,null,null,null,null,null,null,null,null,null,null,null,null,null,null,"AEC PM Approval:",null,"False","","","","","","","","","","",null,null,null,null,null,null,{"$f":"IF($S82=\"true\",SUM(P82:P110),\"\")","v":""}]
[null,null,"Name",null,false,null,0,null,null,null,{"$f":"C83","v":"Name"},null,null,null,"Base Bid",0,{"$f":"IF(S83=$S$1,SUM(P83:P86),0)","v":0},null,"False","","","","","","","","","","",{"$f":"IF($S83=\"true\",M83,\"\")","v":""},{"$f":"IF($S83=\"true\",P83,\"\")","v":""},{"$f":"IF($S83=\"true\",P84,\"\")","v":""},{"$f":"IF($S83=\"true\",P85,\"\")","v":""},{"$f":"IF($S83=\"true\",P86,\"\")","v":""},{"$f":"IF($S83=\"true\",#REF!,\"\")","v":""},{"$f":"IF($S83=\"true\",SUM(P83:P86),\"\")","v":""}]
[null,null,"Name",null,false,null,0,null,false,null,null,null,null,null,"Alternate",0,null,null,"False","","","","","","","","","","",{"$f":"IF($S84=\"true\",M84,\"\")","v":""},{"$f":"IF($S84=\"true\",P84,\"\")","v":""},{"$f":"IF($S84=\"true\",P85,\"\")","v":""},{"$f":"IF($S84=\"true\",P86,\"\")","v":""},{"$f":"IF($S84=\"true\",P87,\"\")","v":""},{"$f":"IF($S84=\"true\",#REF!,\"\")","v":""},{"$f":"IF($S84=\"true\",SUM(P84:P87),\"\")","v":""}]
[null,null,"Name",null,false,null,0,null,false,false,null,null,null,null,"Alternate",0,null,null,"False","","","","","","","","","","",{"$f":"IF($S85=\"true\",M85,\"\")","v":""},{"$f":"IF($S85=\"true\",P85,\"\")","v":""},{"$f":"IF($S85=\"true\",P86,\"\")","v":""},{"$f":"IF($S85=\"true\",P87,\"\")","v":""},{"$f":"IF($S85=\"true\",#REF!,\"\")","v":""},{"$f":"IF($S85=\"true\",#REF!,\"\")","v":""},{"$f":"IF($S85=\"true\",SUM(P85:P108),\"\")","v":""}]
[null,null,"Name",null,false,null,0,null,null,null,null,null,null,null,"Alternate",0,null,null,"False","","","","","","","","","","",{"$f":"IF($S86=\"true\",M86,\"\")","v":""},{"$f":"IF($S86=\"true\",P86,\"\")","v":""},{"$f":"IF($S86=\"true\",P87,\"\")","v":""},{"$f":"IF($S86=\"true\",#REF!,\"\")","v":""},{"$f":"IF($S86=\"true\",#REF!,\"\")","v":""},{"$f":"IF($S86=\"true\",#REF!,\"\")","v":""},{"$f":"IF($S86=\"true\",SUM(P86:P109),\"\")","v":""}]
["Contractor Scope/Trade Detail:",null,null,null,null,null,null,null,null,null,null,null,null,null,null,null,"AEC PM Approval:",null,"False","","","","","","","","","","",null,null,null,null,null,null,{"$f":"IF($S87=\"true\",SUM(P87:P110),\"\")","v":""}]
[null,null,"Name",null,false,null,0,null,null,null,{"$f":"C88","v":"Name"},null,null,null,"Base Bid",0,{"$f":"IF(S88=$S$1,SUM(P88:P91),0)","v":0},null,"False","","","","","","","","","","",{"$f":"IF($S88=\"true\",M88,\"\")","v":""},{"$f":"IF($S88=\"true\",P88,\"\")","v":""},{"$f":"IF($S88=\"true\",P89,\"\")","v":""},{"$f":"IF($S88=\"true\",P90,\"\")","v":""},{"$f":"IF($S88=\"true\",P91,\"\")","v":""},{"$f":"IF($S88=\"true\",#REF!,\"\")","v":""},{"$f":"IF($S88=\"true\",SUM(P88:P91),\"\")","v":""}]
[null,null,"Name",null,false,null,0,null,null,null,null,null,null,null,"Alternate",0,null,null,"False","","","","","","","","","","",{"$f":"IF($S89=\"true\",M89,\"\")","v":""},{"$f":"IF($S89=\"true\",P89,\"\")","v":""},{"$f":"IF($S89=\"true\",P90,\"\")","v":""},{"$f":"IF($S89=\"true\",P91,\"\")","v":""},{"$f":"IF($S89=\"true\",P92,\"\")","v":""},{"$f":"IF($S89=\"true\",#REF!,\"\")","v":""},{"$f":"IF($S89=\"true\",SUM(P89:P92),\"\")","v":""}]
[null,null,"Name",null,false,null,0,null,false,false,null,null,null,null,"Alternate",0,null,null,"False","","","","","","","","","","",{"$f":"IF($S90=\"true\",M90,\"\")","v":""},{"$f":"IF($S90=\"true\",P90,\"\")","v":""},{"$f":"IF($S90=\"true\",P91,\"\")","v":""},{"$f":"IF($S90=\"true\",P92,\"\")","v":""},{"$f":"IF($S90=\"true\",#REF!,\"\")","v":""},{"$f":"IF($S90=\"true\",#REF!,\"\")","v":""},{"$f":"IF($S90=\"true\",SUM(P90:P108),\"\")","v":""}]
[null,null,"Name",null,false,null,0,null,null,null,null,null,null,null,"Alternate",0,null,null,"False","","","","","","","","","","",{"$f":"IF($S91=\"true\",M91,\"\")","v":""},{"$f":"IF($S91=\"true\",P91,\"\")","v":""},{"$f":"IF($S91=\"true\",P92,\"\")","v":""},{"$f":"IF($S91=\"true\",#REF!,\"\")","v":""},{"$f":"IF($S91=\"true\",#REF!,\"\")","v":""},{"$f":"IF($S91=\"true\",#REF!,\"\")","v":""},{"$f":"IF($S91=\"true\",SUM(P91:P109),\"\")","v":""}]
["Contractor Scope/Trade Detail:",null,null,null,null,null,null,null,null,null,null,null,null,null,null,null,"AEC PM Approval:",null,"False","","","","","","","","","","",null,null,null,null,null,null,{"$f":"IF($S92=\"true\",SUM(P92:P110),\"\")","v":""}]
[null,null,"Name",null,false,null,0,null,null,null,{"$f":"C93","v":"Name"},null,null,null,"Base Bid",0,{"$f":"IF(S93=$S$1,SUM(P93:P96),0)","v":0},null,"False","","","","","","","","","","",{"$f":"IF($S93=\"true\",M93,\"\")","v":""},{"$f":"IF($S93=\"true\",P93,\"\")","v":""},{"$f":"IF($S93=\"true\",P94,\"\")","v":""},{"$f":"IF($S93=\"true\",P95,\"\")","v":""},{"$f":"IF($S93=\"true\",P96,\"\")","v":""},{"$f":"IF($S93=\"true\",#REF!,\"\")","v":""},{"$f":"IF($S93=\"true\",SUM(P93:P96),\"\")","v":""}]
[null,null,"Name",null,false,null,0,null,false,null,null,null,null,null,"Alternate",0,null,null,"False","","","","","","","","","","",{"$f":"IF($S94=\"true\",M94,\"\")","v":""},{"$f":"IF($S94=\"true\",P94,\"\")","v":""},{"$f":"IF($S94=\"true\",P95,\"\")","v":""},{"$f":"IF($S94=\"true\",P96,\"\")","v":""},{"$f":"IF($S94=\"true\",P97,\"\")","v":""},{"$f":"IF($S94=\"true\",#REF!,\"\")","v":""},{"$f":"IF($S94=\"true\",SUM(P94:P97),\"\")","v":""}]
[null,null,"Name",null,false,null,0,null,false,null,null,null,null,null,"Alternate",0,null,null,"False","","","","","","","","","","",{"$f":"IF($S95=\"true\",M95,\"\")","v":""},{"$f":"IF($S95=\"true\",P95,\"\")","v":""},{"$f":"IF($S95=\"true\",P96,\"\")","v":""},{"$f":"IF($S95=\"true\",P97,\"\")","v":""},{"$f":"IF($S95=\"true\",#REF!,\"\")","v":""},{"$f":"IF($S95=\"true\",#REF!,\"\")","v":""},{"$f":"IF($S95=\"true\",SUM(P95:P108),\"\")","v":""}]
[null,null,"Name",null,false,null,0,null,null,null,null,null,null,null,"Alternate",0,null,null,"False","","","","","","","","","","",{"$f":"IF($S96=\"true\",M96,\"\")","v":""},{"$f":"IF($S96=\"true\",P96,\"\")","v":""},{"$f":"IF($S96=\"true\",P97,\"\")","v":""},{"$f":"IF($S96=\"true\",#REF!,\"\")","v":""},{"$f":"IF($S96=\"true\",#REF!,\"\")","v":""},{"$f":"IF($S96=\"true\",#REF!,\"\")","v":""},{"$f":"IF($S96=\"true\",SUM(P96:P109),\"\")","v":""}]
["Contractor Scope/Trade Detail:",null,null,null,null,null,null,null,null,null,null,null,null,null,null,null,"AEC PM Approval:",null,"False","","","","","","","","","","",null,null,null,null,null,null,{"$f":"IF($S97=\"true\",SUM(P97:P110),\"\")","v":""}]
[null,null,"Name",null,false,null,0,null,null,null,{"$f":"C98","v":"Name"},null,null,null,"Base Bid",0,{"$f":"IF(S98=$S$1,SUM(P98:P101),0)","v":0},null,"False","","","","","","","","","","",{"$f":"IF($S98=\"true\",M98,\"\")","v":""},{"$f":"IF($S98=\"true\",P98,\"\")","v":""},{"$f":"IF($S98=\"true\",P99,\"\")","v":""},{"$f":"IF($S98=\"true\",P100,\"\")","v":""},{"$f":"IF($S98=\"true\",P101,\"\")","v":""},{"$f":"IF($S98=\"true\",#REF!,\"\")","v":""},{"$f":"IF($S98=\"true\",SUM(P98:P101),\"\")","v":""}]
[null,null,"Name",null,false,null,0,null,false,null,null,null,null,null,"Alternate",0,null,null,"False","","","","","","","","","","",{"$f":"IF($S99=\"true\",M99,\"\")","v":""},{"$f":"IF($S99=\"true\",P99,\"\")","v":""},{"$f":"IF($S99=\"true\",P100,\"\")","v":""},{"$f":"IF($S99=\"true\",P101,\"\")","v":""},{"$f":"IF($S99=\"true\",P102,\"\")","v":""},{"$f":"IF($S99=\"true\",#REF!,\"\")","v":""},{"$f":"IF($S99=\"true\",SUM(P99:P102),\"\")","v":""}]
[null,null,"Name",null,false,null,0,null,null,null,null,null,null,null,"Alternate",0,null,null,"False","","","","","","","","","","",{"$f":"IF($S100=\"true\",M100,\"\")","v":""},{"$f":"IF($S100=\"true\",P100,\"\")","v":""},{"$f":"IF($S100=\"true\",P101,\"\")","v":""},{"$f":"IF($S100=\"true\",P102,\"\")","v":""},{"$f":"IF($S100=\"true\",#REF!,\"\")","v":""},{"$f":"IF($S100=\"true\",#REF!,\"\")","v":""},{"$f":"IF($S100=\"true\",SUM(P100:P108),\"\")","v":""}]
[null,null,"Name",null,false,null,0,null,null,null,null,null,null,null,"Alternate",0,null,null,"False","","","","","","","","","","",{"$f":"IF($S101=\"true\",M101,\"\")","v":""},{"$f":"IF($S101=\"true\",P101,\"\")","v":""},{"$f":"IF($S101=\"true\",P102,\"\")","v":""},{"$f":"IF($S101=\"true\",#REF!,\"\")","v":""},{"$f":"IF($S101=\"true\",#REF!,\"\")","v":""},{"$f":"IF($S101=\"true\",#REF!,\"\")","v":""},{"$f":"IF($S101=\"true\",SUM(P101:P109),\"\")","v":""}]
["Contractor Scope/Trade Detail:",null,null,null,null,null,null,null,null,null,null,null,null,null,null,null,"AEC PM Approval:",null,"False","","","","","","","","","","",null,null,null,null,null,null,{"$f":"IF($S102=\"true\",SUM(P102:P110),\"\")","v":""}]
[null,null,"Name",null,false,null,0,null,false,false,{"$f":"C103","v":"Name"},null,null,null,"Base Bid",0,{"$f":"IF(S103=$S$1,SUM(P103:P106),0)","v":0},null,"False","","","","","","","","","","",{"$f":"IF($S103=\"true\",M103,\"\")","v":""},{"$f":"IF($S103=\"true\",P103,\"\")","v":""},{"$f":"IF($S103=\"true\",P104,\"\")","v":""},{"$f":"IF($S103=\"true\",P105,\"\")","v":""},{"$f":"IF($S103=\"true\",P106,\"\")","v":""},{"$f":"IF($S103=\"true\",#REF!,\"\")","v":""},""]
[null,null,"Name",null,false,null,0,null,false,null,null,null,null,null,"Alternate",0,null,null,"False","","","","","","","","","","",{"$f":"IF($S104=\"true\",M104,\"\")","v":""},{"$f":"IF($S104=\"true\",P104,\"\")","v":""},{"$f":"IF($S104=\"true\",P105,\"\")","v":""},{"$f":"IF($S104=\"true\",P106,\"\")","v":""},{"$f":"IF($S104=\"true\",P107,\"\")","v":""},{"$f":"IF($S104=\"true\",#REF!,\"\")","v":""},""]
[null,null,"Name",null,false,null,0,null,false,false,null,null,null,null,"Alternate",0,null,null,"False","","","","","","","","","","",{"$f":"IF($S105=\"true\",M105,\"\")","v":""},{"$f":"IF($S105=\"true\",P105,\"\")","v":""},{"$f":"IF($S105=\"true\",P106,\"\")","v":""},{"$f":"IF($S105=\"true\",P107,\"\")","v":""},{"$f":"IF($S105=\"true\",#REF!,\"\")","v":""},{"$f":"IF($S105=\"true\",#REF!,\"\")","v":""},{"$f":"IF($S105=\"true\",SUM(P105:P108),\"\")","v":""}]
[null,null,"Name",null,false,null,0,null,null,null,null,null,null,null,"Alternate",0,null,null,"False","","","","","","","","","","",{"$f":"IF($S106=\"true\",M106,\"\")","v":""},{"$f":"IF($S106=\"true\",P106,\"\")","v":""},{"$f":"IF($S106=\"true\",P107,\"\")","v":""},{"$f":"IF($S106=\"true\",#REF!,\"\")","v":""},{"$f":"IF($S106=\"true\",#REF!,\"\")","v":""},{"$f":"IF($S106=\"true\",#REF!,\"\")","v":""},{"$f":"IF($S106=\"true\",SUM(P106:P109),\"\")","v":""}]
["Contractor Scope/Trade Detail:",null,null,null,null,null,null,null,null,null,null,null,null,null,null,null,"AEC PM Approval:"]
[null,null,"Name",null,false,null,0,null,null,null,{"$f":"C108","v":"Name"},null,null,null,"Base Bid",0,{"$f":"SUM(P108:P111)","v":0},null,{"$f":"IF(E108,\"True\",\"False\")","v":"False"},{"$f":"IF($S108=\"true\",A108,\"\")","v":""},{"$f":"IF($S108=\"true\",C108,\"\")","v":""},{"$f":"IF($S108=\"true\",E108,\"\")","v":""},"",{"$f":"IF($S108=\"true\",F108,\"\")","v":""},"",{"$f":"IF($S108=\"true\",I108,\"\")","v":""},"",{"$f":"IF($S108=\"true\",J108,\"\")","v":""},"",{"$f":"IF($S108=\"true\",M108,\"\")","v":""},{"$f":"IF($S108=\"true\",P108,\"\")","v":""},{"$f":"IF($S108=\"true\",P109,\"\")","v":""},{"$f":"IF($S108=\"true\",P110,\"\")","v":""},{"$f":"IF($S108=\"true\",P111,\"\")","v":""},{"$f":"IF($S108=\"true\",#REF!,\"\")","v":""},{"$f":"IF($S108=\"true\",Q108,\"\")","v":""}]
[null,null,"Name",null,false,null,0,null,null,null,null,null,null,null,"Alternate",0,null,null,{"$f":"IF(E109,\"True\",\"False\")","v":"False"},{"$f":"IF($S109=\"true\",A109,\"\")","v":""},{"$f":"IF($S109=\"true\",C109,\"\")","v":""},"","","","","","","","",{"$f":"IF($S109=\"true\",M109,\"\")","v":""},{"$f":"IF($S109=\"true\",P109,\"\")","v":""},{"$f":"IF($S109=\"true\",P110,\"\")","v":""},{"$f":"IF($S109=\"true\",P111,\"\")","v":""},{"$f":"IF($S109=\"true\",P112,\"\")","v":""},{"$f":"IF($S109=\"true\",#REF!,\"\")","v":""},{"$f":"IF($S109=\"true\",Q109,\"\")","v":""}]
[null,null,"Name",null,false,null,0,null,null,null,null,null,null,null,"Alternate",0,null,null,{"$f":"IF(E110,\"True\",\"False\")","v":"False"},{"$f":"IF($S110=\"true\",A110,\"\")","v":""},{"$f":"IF($S110=\"true\",C110,\"\")","v":""},"","","","","","","","",{"$f":"IF($S110=\"true\",M110,\"\")","v":""},{"$f":"IF($S110=\"true\",P110,\"\")","v":""},{"$f":"IF($S110=\"true\",P111,\"\")","v":""},{"$f":"IF($S110=\"true\",P112,\"\")","v":""},{"$f":"IF($S110=\"true\",#REF!,\"\")","v":""},{"$f":"IF($S110=\"true\",#REF!,\"\")","v":""},{"$f":"IF($S110=\"true\",Q110,\"\")","v":""}]
[null,null,"Name",null,false,null,0,null,null,null,null,null,null,null,"Alternate",0,null,null,{"$f":"IF(E111,\"True\",\"False\")","v":"False"},{"$f":"IF($S111=\"true\",A111,\"\")","v":""},{"$f":"IF($S111=\"true\",C111,\"\")","v":""},"","","","","","","","",{"$f":"IF($S111=\"true\",M111,\"\")","v":""},{"$f":"IF($S111=\"true\",P111,\"\")","v":""},{"$f":"IF($S111=\"true\",P112,\"\")","v":""},{"$f":"IF($S111=\"true\",#REF!,\"\")","v":""},{"$f":"IF($S111=\"true\",#REF!,\"\")","v":""},{"$f":"IF($S111=\"true\",#REF!,\"\")","v":""},{"$f":"IF($S111=\"true\",Q111,\"\")","v":""}]
["Contractor Scope/Trade Detail:",null,null,null,null,null,null,null,null,null,null,null,null,null,null,null,"PM Approval:"]
[]
[null,null,null,null,null,null,null,null,null,null,null,"Trade Contractor Subtotal:",null,null,null,"Not to Exceed",{"$f":"SUBTOTAL(9,Q8:R113)","v":0}]
[]
[]
[]
[]
[]
[]
[]
[]
[]
[]
[]
[]
[]
[]
[]
[]
["Full Time Laborer When Contracturally Required"]
["Scope/Trade\n(Includes CSI #'s for clarity)",null,"Proposed Trade Contractor/Self Perform",null,"Self Perform","Decline Bid or No Response","Proposed Amounts \n(low to high)",null,"Basis for Pricing",null,"Selected Firm",null,"EMR",null,"Intended Awardee Proposal Detail  & (accepted alternates only)",null,"Total"]
[null,null,"Name",null,"N/A",null,0,null,null,false,{"$f":"C133","v":"Name"},null,null,null,"Base Bid",0,{"$f":"SUM(P133:P136)","v":0}]
[null,null,"Name",null,"N/A",null,0,null,null,false,null,null,null,null,"Alternate",0]
[null,null,"Name",null,"N/A",null,0,null,false,false,null,null,null,null,"Alternate",0]
[null,null,"Name",null,"N/A",null,0,null,false,null,null,null,null,null,"Alternate",0]
["Contractor Scope/Trade Detail:",null,null,null,null,null,null,null,null,null,null,null,null,null,null,null,"AEC PM Approval:"]
[null,null,"Name",null,"N/A",null,0,null,false,false,{"$f":"C138","v":"Name"},null,null,null,"Base Bid",0,{"$f":"SUM(P138:P141)","v":0}]
[null,null,"Name",null,"N/A",null,0,null,false,false,null,null,null,null,"Alternate",0]
[null,null,"Name",null,"N/A",null,0,null,false,null,null,null,null,null,"Alternate",0]
[null,null,"Name",null,"N/A",null,0,null,false,false,null,null,null,null,"Alternate",0]
["Contractor Scope/Trade Detail:",null,null,null,null,null,null,null,null,null,null,null,null,null,null,null,"PM Approval:"]
[]
[null,null,null,null,null,null,null,null,null,null,null,"Full Time Laborer Subtotal:",null,null,null,"Not to Exceed",{"$f":"SUBTOTAL(9,Q133:R142)","v":0}]
[]
["Self- Perform",null,null,null,null,null,null,null,null,null,null,"(Self Performed is not included in Trade Contractor Subtotal)"]
["Scope/Trade",null,"Trade Contractor",null,"Proposed Amount",null,null,null,null,null,null,null,null,null,null,"Proposed Amount","Total"]
[{"$f":"IFERROR(T148:T148,\"\")","v":""},null,{"$f":"IFERROR(U148,\"\")","v":""},null,{"$f":"IFERROR(Y148,\"$\")","v":"$"},null,null,null,null,null,null,null,null,null,null,{"$f":"IFERROR(AJ148,\"$\")","v":"$"},{"$f":"SUBTOTAL(9,P148:P159)","v":0},null,null,{"$f":"INDEX($T$8:$AM$112,SMALL(IF(COUNTIF($T$5,$T$8:$AM$112),MATCH(ROW($T$8:$AM$112),ROW($T$8:$AM$112)),\"\"),ROWS(V$152:$V152)),COLUMNS(V$152:$V152))","v":{"$error":"#NUM!"}},{"$f":"INDEX($T$8:$AM$112,SMALL(IF(COUNTIF($T$5,$T$8:$AM$112),MATCH(ROW($T$8:$AM$112),ROW($T$8:$AM$112)),\"\"),ROWS($V$152:W152)),COLUMNS($V$152:W152))","v":{"$error":"#NUM!"}},{"$f":"INDEX($T$8:$AM$112,SMALL(IF(COUNTIF($T$5,$T$8:$AM$112),MATCH(ROW($T$8:$AM$112),ROW($T$8:$AM$112)),\"\"),ROWS($V$152:X152)),COLUMNS($V$152:X152))","v":{"$error":"#NUM!"}},{"$f":"INDEX($T$8:$AM$112,SMALL(IF(COUNTIF($T$5,$T$8:$AM$112),MATCH(ROW($T$8:$AM$112),ROW($T$8:$AM$112)),\"\"),ROWS($V$152:Y152)),COLUMNS($V$152:Y152))","v":{"$error":"#NUM!"}},{"$f":"INDEX($T$8:$AM$112,SMALL(IF(COUNTIF($T$5,$T$8:$AM$112),MATCH(ROW($T$8:$AM$112),ROW($T$8:$AM$112)),\"\"),ROWS($V$152:Z152)),COLUMNS($V$152:Z152))","v":{"$error":"#NUM!"}},{"$f":"INDEX($T$8:$AM$112,SMALL(IF(COUNTIF($T$5,$T$8:$AM$112),MATCH(ROW($T$8:$AM$112),ROW($T$8:$AM$112)),\"\"),ROWS($V$152:AA152)),COLUMNS($V$152:AA152))","v":{"$error":"#NUM!"}},{"$f":"INDEX($T$8:$AM$112,SMALL(IF(COUNTIF($T$5,$T$8:$AM$112),MATCH(ROW($T$8:$AM$112),ROW($T$8:$AM$112)),\"\"),ROWS($V$152:AB152)),COLUMNS($V$152:AB152))","v":{"$error":"#NUM!"}},{"$f":"INDEX($T$8:$AM$112,SMALL(IF(COUNTIF($T$5,$T$8:$AM$112),MATCH(ROW($T$8:$AM$112),ROW($T$8:$AM$112)),\"\"),ROWS($V$152:AC152)),COLUMNS($V$152:AC152))","v":{"$error":"#NUM!"}},{"$f":"INDEX($T$8:$AM$112,SMALL(IF(COUNTIF($T$5,$T$8:$AM$112),MATCH(ROW($T$8:$AM$112),ROW($T$8:$AM$112)),\"\"),ROWS($V$152:AD152)),COLUMNS($V$152:AD152))","v":{"$error":"#NUM!"}},{"$f":"INDEX($T$8:$AM$112,SMALL(IF(COUNTIF($T$5,$T$8:$AM$112),MATCH(ROW($T$8:$AM$112),ROW($T$8:$AM$112)),\"\"),ROWS($V$152:AE152)),COLUMNS($V$152:AE152))","v":{"$error":"#NUM!"}},{"$f":"INDEX($T$8:$AM$112,SMALL(IF(COUNTIF($T$5,$T$8:$AM$112),MATCH(ROW($T$8:$AM$112),ROW($T$8:$AM$112)),\"\"),ROWS($V$152:AF152)),COLUMNS($V$152:AF152))","v":{"$error":"#NUM!"}},{"$f":"INDEX($T$8:$AM$112,SMALL(IF(COUNTIF($T$5,$T$8:$AM$112),MATCH(ROW($T$8:$AM$112),ROW($T$8:$AM$112)),\"\"),ROWS($V$152:AG152)),COLUMNS($V$152:AG152))","v":{"$error":"#NUM!"}},{"$f":"INDEX($T$8:$AM$112,SMALL(IF(COUNTIF($T$5,$T$8:$AM$112),MATCH(ROW($T$8:$AM$112),ROW($T$8:$AM$112)),\"\"),ROWS($V$152:AH152)),COLUMNS($V$152:AH152))","v":{"$error":"#NUM!"}},{"$f":"INDEX($T$8:$AM$112,SMALL(IF(COUNTIF($T$5,$T$8:$AM$112),MATCH(ROW($T$8:$AM$112),ROW($T$8:$AM$112)),\"\"),ROWS($V$152:AI152)),COLUMNS($V$152:AI152))","v":{"$error":"#NUM!"}},{"$f":"INDEX($T$8:$AM$112,SMALL(IF(COUNTIF($T$5,$T$8:$AM$112),MATCH(ROW($T$8:$AM$112),ROW($T$8:$AM$112)),\"\"),ROWS($V$152:AJ152)),COLUMNS($V$152:AJ152))","v":{"$error":"#NUM!"}},{"$f":"INDEX($T$8:$AM$112,SMALL(IF(COUNTIF($T$5,$T$8:$AM$112),MATCH(ROW($T$8:$AM$112),ROW($T$8:$AM$112)),\"\"),ROWS($V$152:AK152)),COLUMNS($V$152:AK152))","v":{"$error":"#NUM!"}},{"$f":"INDEX($T$8:$AM$112,SMALL(IF(COUNTIF($T$5,$T$8:$AM$112),MATCH(ROW($T$8:$AM$112),ROW($T$8:$AM$112)),\"\"),ROWS($V$152:AL152)),COLUMNS($V$152:AL152))","v":{"$error":"#NUM!"}},{"$f":"INDEX($T$8:$AM$112,SMALL(IF(COUNTIF($T$5,$T$8:$AM$112),MATCH(ROW($T$8:$AM$112),ROW($T$8:$AM$112)),\"\"),ROWS($V$152:AM152)),COLUMNS($V$152:AM152))","v":{"$error":"#NUM!"}},{"$f":"INDEX($T$8:$AM$112,SMALL(IF(COUNTIF($T$5,$T$8:$AM$112),MATCH(ROW($T$8:$AM$112),ROW($T$8:$AM$112)),\"\"),ROWS($V$152:AN152)),COLUMNS($V$152:AN152))","v":{"$error":"#NUM!"}},{"$f":"INDEX($T$8:$AM$112,SMALL(IF(COUNTIF($T$5,$T$8:$AM$112),MATCH(ROW($T$8:$AM$112),ROW($T$8:$AM$112)),\"\"),ROWS($V$152:AO152)),COLUMNS($V$152:AO152))","v":{"$error":"#NUM!"}},null,null,null,null,null,null,null,null,null,null,"*"]
["",null,"",null,"$",null,null,null,null,null,null,null,null,null,null,{"$f":"IFERROR(AJ149,\"$\")","v":"$"},null,null,null,{"$f":"INDEX($T$8:$AM$112,SMALL(IF(COUNTIF($T$5,$T$8:$AM$112),MATCH(ROW($T$8:$AM$112),ROW($T$8:$AM$112)),\"\"),ROWS(V$152:$V153)),COLUMNS(V$152:$V153))","v":{"$error":"#NUM!"}},{"$f":"INDEX($T$8:$AM$112,SMALL(IF(COUNTIF($T$5,$T$8:$AM$112),MATCH(ROW($T$8:$AM$112),ROW($T$8:$AM$112)),\"\"),ROWS($V$152:W153)),COLUMNS($V$152:W153))","v":{"$error":"#NUM!"}},{"$f":"INDEX($T$8:$AM$112,SMALL(IF(COUNTIF($T$5,$T$8:$AM$112),MATCH(ROW($T$8:$AM$112),ROW($T$8:$AM$112)),\"\"),ROWS($V$152:X153)),COLUMNS($V$152:X153))","v":{"$error":"#NUM!"}},{"$f":"INDEX($T$8:$AM$112,SMALL(IF(COUNTIF($T$5,$T$8:$AM$112),MATCH(ROW($T$8:$AM$112),ROW($T$8:$AM$112)),\"\"),ROWS($V$152:Y153)),COLUMNS($V$152:Y153))","v":{"$error":"#NUM!"}},{"$f":"INDEX($T$8:$AM$112,SMALL(IF(COUNTIF($T$5,$T$8:$AM$112),MATCH(ROW($T$8:$AM$112),ROW($T$8:$AM$112)),\"\"),ROWS($V$152:Z153)),COLUMNS($V$152:Z153))","v":{"$error":"#NUM!"}},{"$f":"INDEX($T$8:$AM$112,SMALL(IF(COUNTIF($T$5,$T$8:$AM$112),MATCH(ROW($T$8:$AM$112),ROW($T$8:$AM$112)),\"\"),ROWS($V$152:AA153)),COLUMNS($V$152:AA153))","v":{"$error":"#NUM!"}},{"$f":"INDEX($T$8:$AM$112,SMALL(IF(COUNTIF($T$5,$T$8:$AM$112),MATCH(ROW($T$8:$AM$112),ROW($T$8:$AM$112)),\"\"),ROWS($V$152:AB153)),COLUMNS($V$152:AB153))","v":{"$error":"#NUM!"}},{"$f":"INDEX($T$8:$AM$112,SMALL(IF(COUNTIF($T$5,$T$8:$AM$112),MATCH(ROW($T$8:$AM$112),ROW($T$8:$AM$112)),\"\"),ROWS($V$152:AC153)),COLUMNS($V$152:AC153))","v":{"$error":"#NUM!"}},{"$f":"INDEX($T$8:$AM$112,SMALL(IF(COUNTIF($T$5,$T$8:$AM$112),MATCH(ROW($T$8:$AM$112),ROW($T$8:$AM$112)),\"\"),ROWS($V$152:AD153)),COLUMNS($V$152:AD153))","v":{"$error":"#NUM!"}},{"$f":"INDEX($T$8:$AM$112,SMALL(IF(COUNTIF($T$5,$T$8:$AM$112),MATCH(ROW($T$8:$AM$112),ROW($T$8:$AM$112)),\"\"),ROWS($V$152:AE153)),COLUMNS($V$152:AE153))","v":{"$error":"#NUM!"}},{"$f":"INDEX($T$8:$AM$112,SMALL(IF(COUNTIF($T$5,$T$8:$AM$112),MATCH(ROW($T$8:$AM$112),ROW($T$8:$AM$112)),\"\"),ROWS($V$152:AF153)),COLUMNS($V$152:AF153))","v":{"$error":"#NUM!"}},{"$f":"INDEX($T$8:$AM$112,SMALL(IF(COUNTIF($T$5,$T$8:$AM$112),MATCH(ROW($T$8:$AM$112),ROW($T$8:$AM$112)),\"\"),ROWS($V$152:AG153)),COLUMNS($V$152:AG153))","v":{"$error":"#NUM!"}},{"$f":"INDEX($T$8:$AM$112,SMALL(IF(COUNTIF($T$5,$T$8:$AM$112),MATCH(ROW($T$8:$AM$112),ROW($T$8:$AM$112)),\"\"),ROWS($V$152:AH153)),COLUMNS($V$152:AH153))","v":{"$error":"#NUM!"}},{"$f":"INDEX($T$8:$AM$112,SMALL(IF(COUNTIF($T$5,$T$8:$AM$112),MATCH(ROW($T$8:$AM$112),ROW($T$8:$AM$112)),\"\"),ROWS($V$152:AI153)),COLUMNS($V$152:AI153))","v":{"$error":"#NUM!"}},{"$f":"INDEX($T$8:$AM$112,SMALL(IF(COUNTIF($T$5,$T$8:$AM$112),MATCH(ROW($T$8:$AM$112),ROW($T$8:$AM$112)),\"\"),ROWS($V$152:AJ153)),COLUMNS($V$152:AJ153))","v":{"$error":"#NUM!"}},{"$f":"INDEX($T$8:$AM$112,SMALL(IF(COUNTIF($T$5,$T$8:$AM$112),MATCH(ROW($T$8:$AM$112),ROW($T$8:$AM$112)),\"\"),ROWS($V$152:AK153)),COLUMNS($V$152:AK153))","v":{"$error":"#NUM!"}},{"$f":"INDEX($T$8:$AM$112,SMALL(IF(COUNTIF($T$5,$T$8:$AM$112),MATCH(ROW($T$8:$AM$112),ROW($T$8:$AM$112)),\"\"),ROWS($V$152:AL153)),COLUMNS($V$152:AL153))","v":{"$error":"#NUM!"}},{"$f":"INDEX($T$8:$AM$112,SMALL(IF(COUNTIF($T$5,$T$8:$AM$112),MATCH(ROW($T$8:$AM$112),ROW($T$8:$AM$112)),\"\"),ROWS($V$152:AM153)),COLUMNS($V$152:AM153))","v":{"$error":"#NUM!"}},{"$f":"INDEX($T$8:$AM$112,SMALL(IF(COUNTIF($T$5,$T$8:$AM$112),MATCH(ROW($T$8:$AM$112),ROW($T$8:$AM$112)),\"\"),ROWS($V$152:AN153)),COLUMNS($V$152:AN153))","v":{"$error":"#NUM!"}},{"$f":"INDEX($T$8:$AM$112,SMALL(IF(COUNTIF($T$5,$T$8:$AM$112),MATCH(ROW($T$8:$AM$112),ROW($T$8:$AM$112)),\"\"),ROWS($V$152:AO153)),COLUMNS($V$152:AO153))","v":{"$error":"#NUM!"}}]
["",null,"",null,"$",null,null,null,null,null,null,null,null,null,null,{"$f":"IFERROR(AJ150,\"$\")","v":"$"},null,null,null,{"$f":"INDEX($T$8:$AM$112,SMALL(IF(COUNTIF($T$5,$T$8:$AM$112),MATCH(ROW($T$8:$AM$112),ROW($T$8:$AM$112)),\"\"),ROWS(V$152:$V154)),COLUMNS(V$152:$V154))","v":{"$error":"#NUM!"}},{"$f":"INDEX($T$8:$AM$112,SMALL(IF(COUNTIF($T$5,$T$8:$AM$112),MATCH(ROW($T$8:$AM$112),ROW($T$8:$AM$112)),\"\"),ROWS($V$152:W154)),COLUMNS($V$152:W154))","v":{"$error":"#NUM!"}},{"$f":"INDEX($T$8:$AM$112,SMALL(IF(COUNTIF($T$5,$T$8:$AM$112),MATCH(ROW($T$8:$AM$112),ROW($T$8:$AM$112)),\"\"),ROWS($V$152:X154)),COLUMNS($V$152:X154))","v":{"$error":"#NUM!"}},{"$f":"INDEX($T$8:$AM$112,SMALL(IF(COUNTIF($T$5,$T$8:$AM$112),MATCH(ROW($T$8:$AM$112),ROW($T$8:$AM$112)),\"\"),ROWS($V$152:Y154)),COLUMNS($V$152:Y154))","v":{"$error":"#NUM!"}},{"$f":"INDEX($T$8:$AM$112,SMALL(IF(COUNTIF($T$5,$T$8:$AM$112),MATCH(ROW($T$8:$AM$112),ROW($T$8:$AM$112)),\"\"),ROWS($V$152:Z154)),COLUMNS($V$152:Z154))","v":{"$error":"#NUM!"}},{"$f":"INDEX($T$8:$AM$112,SMALL(IF(COUNTIF($T$5,$T$8:$AM$112),MATCH(ROW($T$8:$AM$112),ROW($T$8:$AM$112)),\"\"),ROWS($V$152:AA154)),COLUMNS($V$152:AA154))","v":{"$error":"#NUM!"}},{"$f":"INDEX($T$8:$AM$112,SMALL(IF(COUNTIF($T$5,$T$8:$AM$112),MATCH(ROW($T$8:$AM$112),ROW($T$8:$AM$112)),\"\"),ROWS($V$152:AB154)),COLUMNS($V$152:AB154))","v":{"$error":"#NUM!"}},{"$f":"INDEX($T$8:$AM$112,SMALL(IF(COUNTIF($T$5,$T$8:$AM$112),MATCH(ROW($T$8:$AM$112),ROW($T$8:$AM$112)),\"\"),ROWS($V$152:AC154)),COLUMNS($V$152:AC154))","v":{"$error":"#NUM!"}},{"$f":"INDEX($T$8:$AM$112,SMALL(IF(COUNTIF($T$5,$T$8:$AM$112),MATCH(ROW($T$8:$AM$112),ROW($T$8:$AM$112)),\"\"),ROWS($V$152:AD154)),COLUMNS($V$152:AD154))","v":{"$error":"#NUM!"}},{"$f":"INDEX($T$8:$AM$112,SMALL(IF(COUNTIF($T$5,$T$8:$AM$112),MATCH(ROW($T$8:$AM$112),ROW($T$8:$AM$112)),\"\"),ROWS($V$152:AE154)),COLUMNS($V$152:AE154))","v":{"$error":"#NUM!"}},{"$f":"INDEX($T$8:$AM$112,SMALL(IF(COUNTIF($T$5,$T$8:$AM$112),MATCH(ROW($T$8:$AM$112),ROW($T$8:$AM$112)),\"\"),ROWS($V$152:AF154)),COLUMNS($V$152:AF154))","v":{"$error":"#NUM!"}},{"$f":"INDEX($T$8:$AM$112,SMALL(IF(COUNTIF($T$5,$T$8:$AM$112),MATCH(ROW($T$8:$AM$112),ROW($T$8:$AM$112)),\"\"),ROWS($V$152:AG154)),COLUMNS($V$152:AG154))","v":{"$error":"#NUM!"}},{"$f":"INDEX($T$8:$AM$112,SMALL(IF(COUNTIF($T$5,$T$8:$AM$112),MATCH(ROW($T$8:$AM$112),ROW($T$8:$AM$112)),\"\"),ROWS($V$152:AH154)),COLUMNS($V$152:AH154))","v":{"$error":"#NUM!"}},{"$f":"INDEX($T$8:$AM$112,SMALL(IF(COUNTIF($T$5,$T$8:$AM$112),MATCH(ROW($T$8:$AM$112),ROW($T$8:$AM$112)),\"\"),ROWS($V$152:AI154)),COLUMNS($V$152:AI154))","v":{"$error":"#NUM!"}},{"$f":"INDEX($T$8:$AM$112,SMALL(IF(COUNTIF($T$5,$T$8:$AM$112),MATCH(ROW($T$8:$AM$112),ROW($T$8:$AM$112)),\"\"),ROWS($V$152:AJ154)),COLUMNS($V$152:AJ154))","v":{"$error":"#NUM!"}},{"$f":"INDEX($T$8:$AM$112,SMALL(IF(COUNTIF($T$5,$T$8:$AM$112),MATCH(ROW($T$8:$AM$112),ROW($T$8:$AM$112)),\"\"),ROWS($V$152:AK154)),COLUMNS($V$152:AK154))","v":{"$error":"#NUM!"}},{"$f":"INDEX($T$8:$AM$112,SMALL(IF(COUNTIF($T$5,$T$8:$AM$112),MATCH(ROW($T$8:$AM$112),ROW($T$8:$AM$112)),\"\"),ROWS($V$152:AL154)),COLUMNS($V$152:AL154))","v":{"$error":"#NUM!"}},{"$f":"INDEX($T$8:$AM$112,SMALL(IF(COUNTIF($T$5,$T$8:$AM$112),MATCH(ROW($T$8:$AM$112),ROW($T$8:$AM$112)),\"\"),ROWS($V$152:AM154)),COLUMNS($V$152:AM154))","v":{"$error":"#NUM!"}},{"$f":"INDEX($T$8:$AM$112,SMALL(IF(COUNTIF($T$5,$T$8:$AM$112),MATCH(ROW($T$8:$AM$112),ROW($T$8:$AM$112)),\"\"),ROWS($V$152:AN154)),COLUMNS($V$152:AN154))","v":{"$error":"#NUM!"}},{"$f":"INDEX($T$8:$AM$112,SMALL(IF(COUNTIF($T$5,$T$8:$AM$112),MATCH(ROW($T$8:$AM$112),ROW($T$8:$AM$112)),\"\"),ROWS($V$152:AO154)),COLUMNS($V$152:AO154))","v":{"$error":"#NUM!"}}]
["",null,"",null,"$",null,null,null,null,null,null,null,null,null,null,"$",null,null,null,{"$f":"INDEX($T$8:$AM$112,SMALL(IF(COUNTIF($T$5,$T$8:$AM$112),MATCH(ROW($T$8:$AM$112),ROW($T$8:$AM$112)),\"\"),ROWS(V$152:$V155)),COLUMNS(V$152:$V155))","v":{"$error":"#NUM!"}},{"$f":"INDEX($T$8:$AM$112,SMALL(IF(COUNTIF($T$5,$T$8:$AM$112),MATCH(ROW($T$8:$AM$112),ROW($T$8:$AM$112)),\"\"),ROWS($V$152:W155)),COLUMNS($V$152:W155))","v":{"$error":"#NUM!"}},{"$f":"INDEX($T$8:$AM$112,SMALL(IF(COUNTIF($T$5,$T$8:$AM$112),MATCH(ROW($T$8:$AM$112),ROW($T$8:$AM$112)),\"\"),ROWS($V$152:X155)),COLUMNS($V$152:X155))","v":{"$error":"#NUM!"}},{"$f":"INDEX($T$8:$AM$112,SMALL(IF(COUNTIF($T$5,$T$8:$AM$112),MATCH(ROW($T$8:$AM$112),ROW($T$8:$AM$112)),\"\"),ROWS($V$152:Y155)),COLUMNS($V$152:Y155))","v":{"$error":"#NUM!"}},{"$f":"INDEX($T$8:$AM$112,SMALL(IF(COUNTIF($T$5,$T$8:$AM$112),MATCH(ROW($T$8:$AM$112),ROW($T$8:$AM$112)),\"\"),ROWS($V$152:Z155)),COLUMNS($V$152:Z155))","v":{"$error":"#NUM!"}},{"$f":"INDEX($T$8:$AM$112,SMALL(IF(COUNTIF($T$5,$T$8:$AM$112),MATCH(ROW($T$8:$AM$112),ROW($T$8:$AM$112)),\"\"),ROWS($V$152:AA155)),COLUMNS($V$152:AA155))","v":{"$error":"#NUM!"}},{"$f":"INDEX($T$8:$AM$112,SMALL(IF(COUNTIF($T$5,$T$8:$AM$112),MATCH(ROW($T$8:$AM$112),ROW($T$8:$AM$112)),\"\"),ROWS($V$152:AB155)),COLUMNS($V$152:AB155))","v":{"$error":"#NUM!"}},{"$f":"INDEX($T$8:$AM$112,SMALL(IF(COUNTIF($T$5,$T$8:$AM$112),MATCH(ROW($T$8:$AM$112),ROW($T$8:$AM$112)),\"\"),ROWS($V$152:AC155)),COLUMNS($V$152:AC155))","v":{"$error":"#NUM!"}},{"$f":"INDEX($T$8:$AM$112,SMALL(IF(COUNTIF($T$5,$T$8:$AM$112),MATCH(ROW($T$8:$AM$112),ROW($T$8:$AM$112)),\"\"),ROWS($V$152:AD155)),COLUMNS($V$152:AD155))","v":{"$error":"#NUM!"}},{"$f":"INDEX($T$8:$AM$112,SMALL(IF(COUNTIF($T$5,$T$8:$AM$112),MATCH(ROW($T$8:$AM$112),ROW($T$8:$AM$112)),\"\"),ROWS($V$152:AE155)),COLUMNS($V$152:AE155))","v":{"$error":"#NUM!"}},{"$f":"INDEX($T$8:$AM$112,SMALL(IF(COUNTIF($T$5,$T$8:$AM$112),MATCH(ROW($T$8:$AM$112),ROW($T$8:$AM$112)),\"\"),ROWS($V$152:AF155)),COLUMNS($V$152:AF155))","v":{"$error":"#NUM!"}},{"$f":"INDEX($T$8:$AM$112,SMALL(IF(COUNTIF($T$5,$T$8:$AM$112),MATCH(ROW($T$8:$AM$112),ROW($T$8:$AM$112)),\"\"),ROWS($V$152:AG155)),COLUMNS($V$152:AG155))","v":{"$error":"#NUM!"}},{"$f":"INDEX($T$8:$AM$112,SMALL(IF(COUNTIF($T$5,$T$8:$AM$112),MATCH(ROW($T$8:$AM$112),ROW($T$8:$AM$112)),\"\"),ROWS($V$152:AH155)),COLUMNS($V$152:AH155))","v":{"$error":"#NUM!"}},{"$f":"INDEX($T$8:$AM$112,SMALL(IF(COUNTIF($T$5,$T$8:$AM$112),MATCH(ROW($T$8:$AM$112),ROW($T$8:$AM$112)),\"\"),ROWS($V$152:AI155)),COLUMNS($V$152:AI155))","v":{"$error":"#NUM!"}},{"$f":"INDEX($T$8:$AM$112,SMALL(IF(COUNTIF($T$5,$T$8:$AM$112),MATCH(ROW($T$8:$AM$112),ROW($T$8:$AM$112)),\"\"),ROWS($V$152:AJ155)),COLUMNS($V$152:AJ155))","v":{"$error":"#NUM!"}},{"$f":"INDEX($T$8:$AM$112,SMALL(IF(COUNTIF($T$5,$T$8:$AM$112),MATCH(ROW($T$8:$AM$112),ROW($T$8:$AM$112)),\"\"),ROWS($V$152:AK155)),COLUMNS($V$152:AK155))","v":{"$error":"#NUM!"}},{"$f":"INDEX($T$8:$AM$112,SMALL(IF(COUNTIF($T$5,$T$8:$AM$112),MATCH(ROW($T$8:$AM$112),ROW($T$8:$AM$112)),\"\"),ROWS($V$152:AL155)),COLUMNS($V$152:AL155))","v":{"$error":"#NUM!"}},{"$f":"INDEX($T$8:$AM$112,SMALL(IF(COUNTIF($T$5,$T$8:$AM$112),MATCH(ROW($T$8:$AM$112),ROW($T$8:$AM$112)),\"\"),ROWS($V$152:AM155)),COLUMNS($V$152:AM155))","v":{"$error":"#NUM!"}},{"$f":"INDEX($T$8:$AM$112,SMALL(IF(COUNTIF($T$5,$T$8:$AM$112),MATCH(ROW($T$8:$AM$112),ROW($T$8:$AM$112)),\"\"),ROWS($V$152:AN155)),COLUMNS($V$152:AN155))","v":{"$error":"#NUM!"}},{"$f":"INDEX($T$8:$AM$112,SMALL(IF(COUNTIF($T$5,$T$8:$AM$112),MATCH(ROW($T$8:$AM$112),ROW($T$8:$AM$112)),\"\"),ROWS($V$152:AO155)),COLUMNS($V$152:AO155))","v":{"$error":"#NUM!"}}]
["",null,"",null,"$",null,null,null,null,null,null,null,null,null,null,"$",null,null,null,{"$f":"INDEX($T$8:$AM$112,SMALL(IF(COUNTIF($T$5,$T$8:$AM$112),MATCH(ROW($T$8:$AM$112),ROW($T$8:$AM$112)),\"\"),ROWS(V$152:$V156)),COLUMNS(V$152:$V156))","v":{"$error":"#NUM!"}},{"$f":"INDEX($T$8:$AM$112,SMALL(IF(COUNTIF($T$5,$T$8:$AM$112),MATCH(ROW($T$8:$AM$112),ROW($T$8:$AM$112)),\"\"),ROWS($V$152:W156)),COLUMNS($V$152:W156))","v":{"$error":"#NUM!"}},{"$f":"INDEX($T$8:$AM$112,SMALL(IF(COUNTIF($T$5,$T$8:$AM$112),MATCH(ROW($T$8:$AM$112),ROW($T$8:$AM$112)),\"\"),ROWS($V$152:X156)),COLUMNS($V$152:X156))","v":{"$error":"#NUM!"}},{"$f":"INDEX($T$8:$AM$112,SMALL(IF(COUNTIF($T$5,$T$8:$AM$112),MATCH(ROW($T$8:$AM$112),ROW($T$8:$AM$112)),\"\"),ROWS($V$152:Y156)),COLUMNS($V$152:Y156))","v":{"$error":"#NUM!"}},{"$f":"INDEX($T$8:$AM$112,SMALL(IF(COUNTIF($T$5,$T$8:$AM$112),MATCH(ROW($T$8:$AM$112),ROW($T$8:$AM$112)),\"\"),ROWS($V$152:Z156)),COLUMNS($V$152:Z156))","v":{"$error":"#NUM!"}},{"$f":"INDEX($T$8:$AM$112,SMALL(IF(COUNTIF($T$5,$T$8:$AM$112),MATCH(ROW($T$8:$AM$112),ROW($T$8:$AM$112)),\"\"),ROWS($V$152:AA156)),COLUMNS($V$152:AA156))","v":{"$error":"#NUM!"}},{"$f":"INDEX($T$8:$AM$112,SMALL(IF(COUNTIF($T$5,$T$8:$AM$112),MATCH(ROW($T$8:$AM$112),ROW($T$8:$AM$112)),\"\"),ROWS($V$152:AB156)),COLUMNS($V$152:AB156))","v":{"$error":"#NUM!"}},{"$f":"INDEX($T$8:$AM$112,SMALL(IF(COUNTIF($T$5,$T$8:$AM$112),MATCH(ROW($T$8:$AM$112),ROW($T$8:$AM$112)),\"\"),ROWS($V$152:AC156)),COLUMNS($V$152:AC156))","v":{"$error":"#NUM!"}},{"$f":"INDEX($T$8:$AM$112,SMALL(IF(COUNTIF($T$5,$T$8:$AM$112),MATCH(ROW($T$8:$AM$112),ROW($T$8:$AM$112)),\"\"),ROWS($V$152:AD156)),COLUMNS($V$152:AD156))","v":{"$error":"#NUM!"}},{"$f":"INDEX($T$8:$AM$112,SMALL(IF(COUNTIF($T$5,$T$8:$AM$112),MATCH(ROW($T$8:$AM$112),ROW($T$8:$AM$112)),\"\"),ROWS($V$152:AE156)),COLUMNS($V$152:AE156))","v":{"$error":"#NUM!"}},{"$f":"INDEX($T$8:$AM$112,SMALL(IF(COUNTIF($T$5,$T$8:$AM$112),MATCH(ROW($T$8:$AM$112),ROW($T$8:$AM$112)),\"\"),ROWS($V$152:AF156)),COLUMNS($V$152:AF156))","v":{"$error":"#NUM!"}},{"$f":"INDEX($T$8:$AM$112,SMALL(IF(COUNTIF($T$5,$T$8:$AM$112),MATCH(ROW($T$8:$AM$112),ROW($T$8:$AM$112)),\"\"),ROWS($V$152:AG156)),COLUMNS($V$152:AG156))","v":{"$error":"#NUM!"}},{"$f":"INDEX($T$8:$AM$112,SMALL(IF(COUNTIF($T$5,$T$8:$AM$112),MATCH(ROW($T$8:$AM$112),ROW($T$8:$AM$112)),\"\"),ROWS($V$152:AH156)),COLUMNS($V$152:AH156))","v":{"$error":"#NUM!"}},{"$f":"INDEX($T$8:$AM$112,SMALL(IF(COUNTIF($T$5,$T$8:$AM$112),MATCH(ROW($T$8:$AM$112),ROW($T$8:$AM$112)),\"\"),ROWS($V$152:AI156)),COLUMNS($V$152:AI156))","v":{"$error":"#NUM!"}},{"$f":"INDEX($T$8:$AM$112,SMALL(IF(COUNTIF($T$5,$T$8:$AM$112),MATCH(ROW($T$8:$AM$112),ROW($T$8:$AM$112)),\"\"),ROWS($V$152:AJ156)),COLUMNS($V$152:AJ156))","v":{"$error":"#NUM!"}},{"$f":"INDEX($T$8:$AM$112,SMALL(IF(COUNTIF($T$5,$T$8:$AM$112),MATCH(ROW($T$8:$AM$112),ROW($T$8:$AM$112)),\"\"),ROWS($V$152:AK156)),COLUMNS($V$152:AK156))","v":{"$error":"#NUM!"}},{"$f":"INDEX($T$8:$AM$112,SMALL(IF(COUNTIF($T$5,$T$8:$AM$112),MATCH(ROW($T$8:$AM$112),ROW($T$8:$AM$112)),\"\"),ROWS($V$152:AL156)),COLUMNS($V$152:AL156))","v":{"$error":"#NUM!"}},{"$f":"INDEX($T$8:$AM$112,SMALL(IF(COUNTIF($T$5,$T$8:$AM$112),MATCH(ROW($T$8:$AM$112),ROW($T$8:$AM$112)),\"\"),ROWS($V$152:AM156)),COLUMNS($V$152:AM156))","v":{"$error":"#NUM!"}},{"$f":"INDEX($T$8:$AM$112,SMALL(IF(COUNTIF($T$5,$T$8:$AM$112),MATCH(ROW($T$8:$AM$112),ROW($T$8:$AM$112)),\"\"),ROWS($V$152:AN156)),COLUMNS($V$152:AN156))","v":{"$error":"#NUM!"}},{"$f":"INDEX($T$8:$AM$112,SMALL(IF(COUNTIF($T$5,$T$8:$AM$112),MATCH(ROW($T$8:$AM$112),ROW($T$8:$AM$112)),\"\"),ROWS($V$152:AO156)),COLUMNS($V$152:AO156))","v":{"$error":"#NUM!"}}]
["",null,"",null,"$",null,null,null,null,null,null,null,null,null,null,"$",null,null,null,{"$f":"INDEX($T$8:$AM$112,SMALL(IF(COUNTIF($T$5,$T$8:$AM$112),MATCH(ROW($T$8:$AM$112),ROW($T$8:$AM$112)),\"\"),ROWS(V$152:$V157)),COLUMNS(V$152:$V157))","v":{"$error":"#NUM!"}},{"$f":"INDEX($T$8:$AM$112,SMALL(IF(COUNTIF($T$5,$T$8:$AM$112),MATCH(ROW($T$8:$AM$112),ROW($T$8:$AM$112)),\"\"),ROWS($V$152:W157)),COLUMNS($V$152:W157))","v":{"$error":"#NUM!"}},{"$f":"INDEX($T$8:$AM$112,SMALL(IF(COUNTIF($T$5,$T$8:$AM$112),MATCH(ROW($T$8:$AM$112),ROW($T$8:$AM$112)),\"\"),ROWS($V$152:X157)),COLUMNS($V$152:X157))","v":{"$error":"#NUM!"}},{"$f":"INDEX($T$8:$AM$112,SMALL(IF(COUNTIF($T$5,$T$8:$AM$112),MATCH(ROW($T$8:$AM$112),ROW($T$8:$AM$112)),\"\"),ROWS($V$152:Y157)),COLUMNS($V$152:Y157))","v":{"$error":"#NUM!"}},{"$f":"INDEX($T$8:$AM$112,SMALL(IF(COUNTIF($T$5,$T$8:$AM$112),MATCH(ROW($T$8:$AM$112),ROW($T$8:$AM$112)),\"\"),ROWS($V$152:Z157)),COLUMNS($V$152:Z157))","v":{"$error":"#NUM!"}},{"$f":"INDEX($T$8:$AM$112,SMALL(IF(COUNTIF($T$5,$T$8:$AM$112),MATCH(ROW($T$8:$AM$112),ROW($T$8:$AM$112)),\"\"),ROWS($V$152:AA157)),COLUMNS($V$152:AA157))","v":{"$error":"#NUM!"}},{"$f":"INDEX($T$8:$AM$112,SMALL(IF(COUNTIF($T$5,$T$8:$AM$112),MATCH(ROW($T$8:$AM$112),ROW($T$8:$AM$112)),\"\"),ROWS($V$152:AB157)),COLUMNS($V$152:AB157))","v":{"$error":"#NUM!"}},{"$f":"INDEX($T$8:$AM$112,SMALL(IF(COUNTIF($T$5,$T$8:$AM$112),MATCH(ROW($T$8:$AM$112),ROW($T$8:$AM$112)),\"\"),ROWS($V$152:AC157)),COLUMNS($V$152:AC157))","v":{"$error":"#NUM!"}},{"$f":"INDEX($T$8:$AM$112,SMALL(IF(COUNTIF($T$5,$T$8:$AM$112),MATCH(ROW($T$8:$AM$112),ROW($T$8:$AM$112)),\"\"),ROWS($V$152:AD157)),COLUMNS($V$152:AD157))","v":{"$error":"#NUM!"}},{"$f":"INDEX($T$8:$AM$112,SMALL(IF(COUNTIF($T$5,$T$8:$AM$112),MATCH(ROW($T$8:$AM$112),ROW($T$8:$AM$112)),\"\"),ROWS($V$152:AE157)),COLUMNS($V$152:AE157))","v":{"$error":"#NUM!"}},{"$f":"INDEX($T$8:$AM$112,SMALL(IF(COUNTIF($T$5,$T$8:$AM$112),MATCH(ROW($T$8:$AM$112),ROW($T$8:$AM$112)),\"\"),ROWS($V$152:AF157)),COLUMNS($V$152:AF157))","v":{"$error":"#NUM!"}},{"$f":"INDEX($T$8:$AM$112,SMALL(IF(COUNTIF($T$5,$T$8:$AM$112),MATCH(ROW($T$8:$AM$112),ROW($T$8:$AM$112)),\"\"),ROWS($V$152:AG157)),COLUMNS($V$152:AG157))","v":{"$error":"#NUM!"}},{"$f":"INDEX($T$8:$AM$112,SMALL(IF(COUNTIF($T$5,$T$8:$AM$112),MATCH(ROW($T$8:$AM$112),ROW($T$8:$AM$112)),\"\"),ROWS($V$152:AH157)),COLUMNS($V$152:AH157))","v":{"$error":"#NUM!"}},{"$f":"INDEX($T$8:$AM$112,SMALL(IF(COUNTIF($T$5,$T$8:$AM$112),MATCH(ROW($T$8:$AM$112),ROW($T$8:$AM$112)),\"\"),ROWS($V$152:AI157)),COLUMNS($V$152:AI157))","v":{"$error":"#NUM!"}},{"$f":"INDEX($T$8:$AM$112,SMALL(IF(COUNTIF($T$5,$T$8:$AM$112),MATCH(ROW($T$8:$AM$112),ROW($T$8:$AM$112)),\"\"),ROWS($V$152:AJ157)),COLUMNS($V$152:AJ157))","v":{"$error":"#NUM!"}},{"$f":"INDEX($T$8:$AM$112,SMALL(IF(COUNTIF($T$5,$T$8:$AM$112),MATCH(ROW($T$8:$AM$112),ROW($T$8:$AM$112)),\"\"),ROWS($V$152:AK157)),COLUMNS($V$152:AK157))","v":{"$error":"#NUM!"}},{"$f":"INDEX($T$8:$AM$112,SMALL(IF(COUNTIF($T$5,$T$8:$AM$112),MATCH(ROW($T$8:$AM$112),ROW($T$8:$AM$112)),\"\"),ROWS($V$152:AL157)),COLUMNS($V$152:AL157))","v":{"$error":"#NUM!"}},{"$f":"INDEX($T$8:$AM$112,SMALL(IF(COUNTIF($T$5,$T$8:$AM$112),MATCH(ROW($T$8:$AM$112),ROW($T$8:$AM$112)),\"\"),ROWS($V$152:AM157)),COLUMNS($V$152:AM157))","v":{"$error":"#NUM!"}},{"$f":"INDEX($T$8:$AM$112,SMALL(IF(COUNTIF($T$5,$T$8:$AM$112),MATCH(ROW($T$8:$AM$112),ROW($T$8:$AM$112)),\"\"),ROWS($V$152:AN157)),COLUMNS($V$152:AN157))","v":{"$error":"#NUM!"}},{"$f":"INDEX($T$8:$AM$112,SMALL(IF(COUNTIF($T$5,$T$8:$AM$112),MATCH(ROW($T$8:$AM$112),ROW($T$8:$AM$112)),\"\"),ROWS($V$152:AO157)),COLUMNS($V$152:AO157))","v":{"$error":"#NUM!"}}]
[{"$f":"IFERROR(T154:T154,\"\")","v":""},null,{"$f":"IFERROR(U154,\"\")","v":""},null,{"$f":"IFERROR(Y154,\"$\")","v":"$"},null,null,null,null,null,null,null,null,null,null,"$",null,null,null,{"$f":"INDEX($T$8:$AM$112,SMALL(IF(COUNTIF($T$5,$T$8:$AM$112),MATCH(ROW($T$8:$AM$112),ROW($T$8:$AM$112)),\"\"),ROWS(V$152:$V158)),COLUMNS(V$152:$V158))","v":{"$error":"#NUM!"}},{"$f":"INDEX($T$8:$AM$112,SMALL(IF(COUNTIF($T$5,$T$8:$AM$112),MATCH(ROW($T$8:$AM$112),ROW($T$8:$AM$112)),\"\"),ROWS($V$152:W158)),COLUMNS($V$152:W158))","v":{"$error":"#NUM!"}},{"$f":"INDEX($T$8:$AM$112,SMALL(IF(COUNTIF($T$5,$T$8:$AM$112),MATCH(ROW($T$8:$AM$112),ROW($T$8:$AM$112)),\"\"),ROWS($V$152:X158)),COLUMNS($V$152:X158))","v":{"$error":"#NUM!"}},{"$f":"INDEX($T$8:$AM$112,SMALL(IF(COUNTIF($T$5,$T$8:$AM$112),MATCH(ROW($T$8:$AM$112),ROW($T$8:$AM$112)),\"\"),ROWS($V$152:Y158)),COLUMNS($V$152:Y158))","v":{"$error":"#NUM!"}},{"$f":"INDEX($T$8:$AM$112,SMALL(IF(COUNTIF($T$5,$T$8:$AM$112),MATCH(ROW($T$8:$AM$112),ROW($T$8:$AM$112)),\"\"),ROWS($V$152:Z158)),COLUMNS($V$152:Z158))","v":{"$error":"#NUM!"}},{"$f":"INDEX($T$8:$AM$112,SMALL(IF(COUNTIF($T$5,$T$8:$AM$112),MATCH(ROW($T$8:$AM$112),ROW($T$8:$AM$112)),\"\"),ROWS($V$152:AA158)),COLUMNS($V$152:AA158))","v":{"$error":"#NUM!"}},{"$f":"INDEX($T$8:$AM$112,SMALL(IF(COUNTIF($T$5,$T$8:$AM$112),MATCH(ROW($T$8:$AM$112),ROW($T$8:$AM$112)),\"\"),ROWS($V$152:AB158)),COLUMNS($V$152:AB158))","v":{"$error":"#NUM!"}},{"$f":"INDEX($T$8:$AM$112,SMALL(IF(COUNTIF($T$5,$T$8:$AM$112),MATCH(ROW($T$8:$AM$112),ROW($T$8:$AM$112)),\"\"),ROWS($V$152:AC158)),COLUMNS($V$152:AC158))","v":{"$error":"#NUM!"}},{"$f":"INDEX($T$8:$AM$112,SMALL(IF(COUNTIF($T$5,$T$8:$AM$112),MATCH(ROW($T$8:$AM$112),ROW($T$8:$AM$112)),\"\"),ROWS($V$152:AD158)),COLUMNS($V$152:AD158))","v":{"$error":"#NUM!"}},{"$f":"INDEX($T$8:$AM$112,SMALL(IF(COUNTIF($T$5,$T$8:$AM$112),MATCH(ROW($T$8:$AM$112),ROW($T$8:$AM$112)),\"\"),ROWS($V$152:AE158)),COLUMNS($V$152:AE158))","v":{"$error":"#NUM!"}},{"$f":"INDEX($T$8:$AM$112,SMALL(IF(COUNTIF($T$5,$T$8:$AM$112),MATCH(ROW($T$8:$AM$112),ROW($T$8:$AM$112)),\"\"),ROWS($V$152:AF158)),COLUMNS($V$152:AF158))","v":{"$error":"#NUM!"}},{"$f":"INDEX($T$8:$AM$112,SMALL(IF(COUNTIF($T$5,$T$8:$AM$112),MATCH(ROW($T$8:$AM$112),ROW($T$8:$AM$112)),\"\"),ROWS($V$152:AG158)),COLUMNS($V$152:AG158))","v":{"$error":"#NUM!"}},{"$f":"INDEX($T$8:$AM$112,SMALL(IF(COUNTIF($T$5,$T$8:$AM$112),MATCH(ROW($T$8:$AM$112),ROW($T$8:$AM$112)),\"\"),ROWS($V$152:AH158)),COLUMNS($V$152:AH158))","v":{"$error":"#NUM!"}},{"$f":"INDEX($T$8:$AM$112,SMALL(IF(COUNTIF($T$5,$T$8:$AM$112),MATCH(ROW($T$8:$AM$112),ROW($T$8:$AM$112)),\"\"),ROWS($V$152:AI158)),COLUMNS($V$152:AI158))","v":{"$error":"#NUM!"}},{"$f":"INDEX($T$8:$AM$112,SMALL(IF(COUNTIF($T$5,$T$8:$AM$112),MATCH(ROW($T$8:$AM$112),ROW($T$8:$AM$112)),\"\"),ROWS($V$152:AJ158)),COLUMNS($V$152:AJ158))","v":{"$error":"#NUM!"}},{"$f":"INDEX($T$8:$AM$112,SMALL(IF(COUNTIF($T$5,$T$8:$AM$112),MATCH(ROW($T$8:$AM$112),ROW($T$8:$AM$112)),\"\"),ROWS($V$152:AK158)),COLUMNS($V$152:AK158))","v":{"$error":"#NUM!"}},{"$f":"INDEX($T$8:$AM$112,SMALL(IF(COUNTIF($T$5,$T$8:$AM$112),MATCH(ROW($T$8:$AM$112),ROW($T$8:$AM$112)),\"\"),ROWS($V$152:AL158)),COLUMNS($V$152:AL158))","v":{"$error":"#NUM!"}},{"$f":"INDEX($T$8:$AM$112,SMALL(IF(COUNTIF($T$5,$T$8:$AM$112),MATCH(ROW($T$8:$AM$112),ROW($T$8:$AM$112)),\"\"),ROWS($V$152:AM158)),COLUMNS($V$152:AM158))","v":{"$error":"#NUM!"}},{"$f":"INDEX($T$8:$AM$112,SMALL(IF(COUNTIF($T$5,$T$8:$AM$112),MATCH(ROW($T$8:$AM$112),ROW($T$8:$AM$112)),\"\"),ROWS($V$152:AN158)),COLUMNS($V$152:AN158))","v":{"$error":"#NUM!"}},{"$f":"INDEX($T$8:$AM$112,SMALL(IF(COUNTIF($T$5,$T$8:$AM$112),MATCH(ROW($T$8:$AM$112),ROW($T$8:$AM$112)),\"\"),ROWS($V$152:AO158)),COLUMNS($V$152:AO158))","v":{"$error":"#NUM!"}}]
["",null,"",null,"$",null,null,null,null,null,null,null,null,null,null,"$",null,null,null,{"$f":"INDEX($T$8:$AM$112,SMALL(IF(COUNTIF($T$5,$T$8:$AM$112),MATCH(ROW($T$8:$AM$112),ROW($T$8:$AM$112)),\"\"),ROWS(V$152:$V159)),COLUMNS(V$152:$V159))","v":{"$error":"#NUM!"}},{"$f":"INDEX($T$8:$AM$112,SMALL(IF(COUNTIF($T$5,$T$8:$AM$112),MATCH(ROW($T$8:$AM$112),ROW($T$8:$AM$112)),\"\"),ROWS($V$152:W159)),COLUMNS($V$152:W159))","v":{"$error":"#NUM!"}},{"$f":"INDEX($T$8:$AM$112,SMALL(IF(COUNTIF($T$5,$T$8:$AM$112),MATCH(ROW($T$8:$AM$112),ROW($T$8:$AM$112)),\"\"),ROWS($V$152:X159)),COLUMNS($V$152:X159))","v":{"$error":"#NUM!"}},{"$f":"INDEX($T$8:$AM$112,SMALL(IF(COUNTIF($T$5,$T$8:$AM$112),MATCH(ROW($T$8:$AM$112),ROW($T$8:$AM$112)),\"\"),ROWS($V$152:Y159)),COLUMNS($V$152:Y159))","v":{"$error":"#NUM!"}},{"$f":"INDEX($T$8:$AM$112,SMALL(IF(COUNTIF($T$5,$T$8:$AM$112),MATCH(ROW($T$8:$AM$112),ROW($T$8:$AM$112)),\"\"),ROWS($V$152:Z159)),COLUMNS($V$152:Z159))","v":{"$error":"#NUM!"}},{"$f":"INDEX($T$8:$AM$112,SMALL(IF(COUNTIF($T$5,$T$8:$AM$112),MATCH(ROW($T$8:$AM$112),ROW($T$8:$AM$112)),\"\"),ROWS($V$152:AA159)),COLUMNS($V$152:AA159))","v":{"$error":"#NUM!"}},{"$f":"INDEX($T$8:$AM$112,SMALL(IF(COUNTIF($T$5,$T$8:$AM$112),MATCH(ROW($T$8:$AM$112),ROW($T$8:$AM$112)),\"\"),ROWS($V$152:AB159)),COLUMNS($V$152:AB159))","v":{"$error":"#NUM!"}},{"$f":"INDEX($T$8:$AM$112,SMALL(IF(COUNTIF($T$5,$T$8:$AM$112),MATCH(ROW($T$8:$AM$112),ROW($T$8:$AM$112)),\"\"),ROWS($V$152:AC159)),COLUMNS($V$152:AC159))","v":{"$error":"#NUM!"}},{"$f":"INDEX($T$8:$AM$112,SMALL(IF(COUNTIF($T$5,$T$8:$AM$112),MATCH(ROW($T$8:$AM$112),ROW($T$8:$AM$112)),\"\"),ROWS($V$152:AD159)),COLUMNS($V$152:AD159))","v":{"$error":"#NUM!"}},{"$f":"INDEX($T$8:$AM$112,SMALL(IF(COUNTIF($T$5,$T$8:$AM$112),MATCH(ROW($T$8:$AM$112),ROW($T$8:$AM$112)),\"\"),ROWS($V$152:AE159)),COLUMNS($V$152:AE159))","v":{"$error":"#NUM!"}},{"$f":"INDEX($T$8:$AM$112,SMALL(IF(COUNTIF($T$5,$T$8:$AM$112),MATCH(ROW($T$8:$AM$112),ROW($T$8:$AM$112)),\"\"),ROWS($V$152:AF159)),COLUMNS($V$152:AF159))","v":{"$error":"#NUM!"}},{"$f":"INDEX($T$8:$AM$112,SMALL(IF(COUNTIF($T$5,$T$8:$AM$112),MATCH(ROW($T$8:$AM$112),ROW($T$8:$AM$112)),\"\"),ROWS($V$152:AG159)),COLUMNS($V$152:AG159))","v":{"$error":"#NUM!"}},{"$f":"INDEX($T$8:$AM$112,SMALL(IF(COUNTIF($T$5,$T$8:$AM$112),MATCH(ROW($T$8:$AM$112),ROW($T$8:$AM$112)),\"\"),ROWS($V$152:AH159)),COLUMNS($V$152:AH159))","v":{"$error":"#NUM!"}},{"$f":"INDEX($T$8:$AM$112,SMALL(IF(COUNTIF($T$5,$T$8:$AM$112),MATCH(ROW($T$8:$AM$112),ROW($T$8:$AM$112)),\"\"),ROWS($V$152:AI159)),COLUMNS($V$152:AI159))","v":{"$error":"#NUM!"}},{"$f":"INDEX($T$8:$AM$112,SMALL(IF(COUNTIF($T$5,$T$8:$AM$112),MATCH(ROW($T$8:$AM$112),ROW($T$8:$AM$112)),\"\"),ROWS($V$152:AJ159)),COLUMNS($V$152:AJ159))","v":{"$error":"#NUM!"}},{"$f":"INDEX($T$8:$AM$112,SMALL(IF(COUNTIF($T$5,$T$8:$AM$112),MATCH(ROW($T$8:$AM$112),ROW($T$8:$AM$112)),\"\"),ROWS($V$152:AK159)),COLUMNS($V$152:AK159))","v":{"$error":"#NUM!"}},{"$f":"INDEX($T$8:$AM$112,SMALL(IF(COUNTIF($T$5,$T$8:$AM$112),MATCH(ROW($T$8:$AM$112),ROW($T$8:$AM$112)),\"\"),ROWS($V$152:AL159)),COLUMNS($V$152:AL159))","v":{"$error":"#NUM!"}},{"$f":"INDEX($T$8:$AM$112,SMALL(IF(COUNTIF($T$5,$T$8:$AM$112),MATCH(ROW($T$8:$AM$112),ROW($T$8:$AM$112)),\"\"),ROWS($V$152:AM159)),COLUMNS($V$152:AM159))","v":{"$error":"#NUM!"}},{"$f":"INDEX($T$8:$AM$112,SMALL(IF(COUNTIF($T$5,$T$8:$AM$112),MATCH(ROW($T$8:$AM$112),ROW($T$8:$AM$112)),\"\"),ROWS($V$152:AN159)),COLUMNS($V$152:AN159))","v":{"$error":"#NUM!"}},{"$f":"INDEX($T$8:$AM$112,SMALL(IF(COUNTIF($T$5,$T$8:$AM$112),MATCH(ROW($T$8:$AM$112),ROW($T$8:$AM$112)),\"\"),ROWS($V$152:AO159)),COLUMNS($V$152:AO159))","v":{"$error":"#NUM!"}}]
["",null,"",null,"$",null,null,null,null,null,null,null,null,null,null,"$",null,null,null,{"$f":"INDEX($T$8:$AM$112,SMALL(IF(COUNTIF($T$5,$T$8:$AM$112),MATCH(ROW($T$8:$AM$112),ROW($T$8:$AM$112)),\"\"),ROWS(V$152:$V160)),COLUMNS(V$152:$V160))","v":{"$error":"#NUM!"}},{"$f":"INDEX($T$8:$AM$112,SMALL(IF(COUNTIF($T$5,$T$8:$AM$112),MATCH(ROW($T$8:$AM$112),ROW($T$8:$AM$112)),\"\"),ROWS($V$152:W160)),COLUMNS($V$152:W160))","v":{"$error":"#NUM!"}},{"$f":"INDEX($T$8:$AM$112,SMALL(IF(COUNTIF($T$5,$T$8:$AM$112),MATCH(ROW($T$8:$AM$112),ROW($T$8:$AM$112)),\"\"),ROWS($V$152:X160)),COLUMNS($V$152:X160))","v":{"$error":"#NUM!"}},{"$f":"INDEX($T$8:$AM$112,SMALL(IF(COUNTIF($T$5,$T$8:$AM$112),MATCH(ROW($T$8:$AM$112),ROW($T$8:$AM$112)),\"\"),ROWS($V$152:Y160)),COLUMNS($V$152:Y160))","v":{"$error":"#NUM!"}},{"$f":"INDEX($T$8:$AM$112,SMALL(IF(COUNTIF($T$5,$T$8:$AM$112),MATCH(ROW($T$8:$AM$112),ROW($T$8:$AM$112)),\"\"),ROWS($V$152:Z160)),COLUMNS($V$152:Z160))","v":{"$error":"#NUM!"}},{"$f":"INDEX($T$8:$AM$112,SMALL(IF(COUNTIF($T$5,$T$8:$AM$112),MATCH(ROW($T$8:$AM$112),ROW($T$8:$AM$112)),\"\"),ROWS($V$152:AA160)),COLUMNS($V$152:AA160))","v":{"$error":"#NUM!"}},{"$f":"INDEX($T$8:$AM$112,SMALL(IF(COUNTIF($T$5,$T$8:$AM$112),MATCH(ROW($T$8:$AM$112),ROW($T$8:$AM$112)),\"\"),ROWS($V$152:AB160)),COLUMNS($V$152:AB160))","v":{"$error":"#NUM!"}},{"$f":"INDEX($T$8:$AM$112,SMALL(IF(COUNTIF($T$5,$T$8:$AM$112),MATCH(ROW($T$8:$AM$112),ROW($T$8:$AM$112)),\"\"),ROWS($V$152:AC160)),COLUMNS($V$152:AC160))","v":{"$error":"#NUM!"}},{"$f":"INDEX($T$8:$AM$112,SMALL(IF(COUNTIF($T$5,$T$8:$AM$112),MATCH(ROW($T$8:$AM$112),ROW($T$8:$AM$112)),\"\"),ROWS($V$152:AD160)),COLUMNS($V$152:AD160))","v":{"$error":"#NUM!"}},{"$f":"INDEX($T$8:$AM$112,SMALL(IF(COUNTIF($T$5,$T$8:$AM$112),MATCH(ROW($T$8:$AM$112),ROW($T$8:$AM$112)),\"\"),ROWS($V$152:AE160)),COLUMNS($V$152:AE160))","v":{"$error":"#NUM!"}},{"$f":"INDEX($T$8:$AM$112,SMALL(IF(COUNTIF($T$5,$T$8:$AM$112),MATCH(ROW($T$8:$AM$112),ROW($T$8:$AM$112)),\"\"),ROWS($V$152:AF160)),COLUMNS($V$152:AF160))","v":{"$error":"#NUM!"}},{"$f":"INDEX($T$8:$AM$112,SMALL(IF(COUNTIF($T$5,$T$8:$AM$112),MATCH(ROW($T$8:$AM$112),ROW($T$8:$AM$112)),\"\"),ROWS($V$152:AG160)),COLUMNS($V$152:AG160))","v":{"$error":"#NUM!"}},{"$f":"INDEX($T$8:$AM$112,SMALL(IF(COUNTIF($T$5,$T$8:$AM$112),MATCH(ROW($T$8:$AM$112),ROW($T$8:$AM$112)),\"\"),ROWS($V$152:AH160)),COLUMNS($V$152:AH160))","v":{"$error":"#NUM!"}},{"$f":"INDEX($T$8:$AM$112,SMALL(IF(COUNTIF($T$5,$T$8:$AM$112),MATCH(ROW($T$8:$AM$112),ROW($T$8:$AM$112)),\"\"),ROWS($V$152:AI160)),COLUMNS($V$152:AI160))","v":{"$error":"#NUM!"}},{"$f":"INDEX($T$8:$AM$112,SMALL(IF(COUNTIF($T$5,$T$8:$AM$112),MATCH(ROW($T$8:$AM$112),ROW($T$8:$AM$112)),\"\"),ROWS($V$152:AJ160)),COLUMNS($V$152:AJ160))","v":{"$error":"#NUM!"}},{"$f":"INDEX($T$8:$AM$112,SMALL(IF(COUNTIF($T$5,$T$8:$AM$112),MATCH(ROW($T$8:$AM$112),ROW($T$8:$AM$112)),\"\"),ROWS($V$152:AK160)),COLUMNS($V$152:AK160))","v":{"$error":"#NUM!"}},{"$f":"INDEX($T$8:$AM$112,SMALL(IF(COUNTIF($T$5,$T$8:$AM$112),MATCH(ROW($T$8:$AM$112),ROW($T$8:$AM$112)),\"\"),ROWS($V$152:AL160)),COLUMNS($V$152:AL160))","v":{"$error":"#NUM!"}},{"$f":"INDEX($T$8:$AM$112,SMALL(IF(COUNTIF($T$5,$T$8:$AM$112),MATCH(ROW($T$8:$AM$112),ROW($T$8:$AM$112)),\"\"),ROWS($V$152:AM160)),COLUMNS($V$152:AM160))","v":{"$error":"#NUM!"}},{"$f":"INDEX($T$8:$AM$112,SMALL(IF(COUNTIF($T$5,$T$8:$AM$112),MATCH(ROW($T$8:$AM$112),ROW($T$8:$AM$112)),\"\"),ROWS($V$152:AN160)),COLUMNS($V$152:AN160))","v":{"$error":"#NUM!"}},{"$f":"INDEX($T$8:$AM$112,SMALL(IF(COUNTIF($T$5,$T$8:$AM$112),MATCH(ROW($T$8:$AM$112),ROW($T$8:$AM$112)),\"\"),ROWS($V$152:AO160)),COLUMNS($V$152:AO160))","v":{"$error":"#NUM!"}}]
["",null,"",null,"$",null,null,null,null,null,null,null,null,null,null,"$",null,null,null,{"$f":"INDEX($T$8:$AM$112,SMALL(IF(COUNTIF($T$5,$T$8:$AM$112),MATCH(ROW($T$8:$AM$112),ROW($T$8:$AM$112)),\"\"),ROWS(V$152:$V161)),COLUMNS(V$152:$V161))","v":{"$error":"#NUM!"}},{"$f":"INDEX($T$8:$AM$112,SMALL(IF(COUNTIF($T$5,$T$8:$AM$112),MATCH(ROW($T$8:$AM$112),ROW($T$8:$AM$112)),\"\"),ROWS($V$152:W161)),COLUMNS($V$152:W161))","v":{"$error":"#NUM!"}},{"$f":"INDEX($T$8:$AM$112,SMALL(IF(COUNTIF($T$5,$T$8:$AM$112),MATCH(ROW($T$8:$AM$112),ROW($T$8:$AM$112)),\"\"),ROWS($V$152:X161)),COLUMNS($V$152:X161))","v":{"$error":"#NUM!"}},{"$f":"INDEX($T$8:$AM$112,SMALL(IF(COUNTIF($T$5,$T$8:$AM$112),MATCH(ROW($T$8:$AM$112),ROW($T$8:$AM$112)),\"\"),ROWS($V$152:Y161)),COLUMNS($V$152:Y161))","v":{"$error":"#NUM!"}},{"$f":"INDEX($T$8:$AM$112,SMALL(IF(COUNTIF($T$5,$T$8:$AM$112),MATCH(ROW($T$8:$AM$112),ROW($T$8:$AM$112)),\"\"),ROWS($V$152:Z161)),COLUMNS($V$152:Z161))","v":{"$error":"#NUM!"}},{"$f":"INDEX($T$8:$AM$112,SMALL(IF(COUNTIF($T$5,$T$8:$AM$112),MATCH(ROW($T$8:$AM$112),ROW($T$8:$AM$112)),\"\"),ROWS($V$152:AA161)),COLUMNS($V$152:AA161))","v":{"$error":"#NUM!"}},{"$f":"INDEX($T$8:$AM$112,SMALL(IF(COUNTIF($T$5,$T$8:$AM$112),MATCH(ROW($T$8:$AM$112),ROW($T$8:$AM$112)),\"\"),ROWS($V$152:AB161)),COLUMNS($V$152:AB161))","v":{"$error":"#NUM!"}},{"$f":"INDEX($T$8:$AM$112,SMALL(IF(COUNTIF($T$5,$T$8:$AM$112),MATCH(ROW($T$8:$AM$112),ROW($T$8:$AM$112)),\"\"),ROWS($V$152:AC161)),COLUMNS($V$152:AC161))","v":{"$error":"#NUM!"}},{"$f":"INDEX($T$8:$AM$112,SMALL(IF(COUNTIF($T$5,$T$8:$AM$112),MATCH(ROW($T$8:$AM$112),ROW($T$8:$AM$112)),\"\"),ROWS($V$152:AD161)),COLUMNS($V$152:AD161))","v":{"$error":"#NUM!"}},{"$f":"INDEX($T$8:$AM$112,SMALL(IF(COUNTIF($T$5,$T$8:$AM$112),MATCH(ROW($T$8:$AM$112),ROW($T$8:$AM$112)),\"\"),ROWS($V$152:AE161)),COLUMNS($V$152:AE161))","v":{"$error":"#NUM!"}},{"$f":"INDEX($T$8:$AM$112,SMALL(IF(COUNTIF($T$5,$T$8:$AM$112),MATCH(ROW($T$8:$AM$112),ROW($T$8:$AM$112)),\"\"),ROWS($V$152:AF161)),COLUMNS($V$152:AF161))","v":{"$error":"#NUM!"}},{"$f":"INDEX($T$8:$AM$112,SMALL(IF(COUNTIF($T$5,$T$8:$AM$112),MATCH(ROW($T$8:$AM$112),ROW($T$8:$AM$112)),\"\"),ROWS($V$152:AG161)),COLUMNS($V$152:AG161))","v":{"$error":"#NUM!"}},{"$f":"INDEX($T$8:$AM$112,SMALL(IF(COUNTIF($T$5,$T$8:$AM$112),MATCH(ROW($T$8:$AM$112),ROW($T$8:$AM$112)),\"\"),ROWS($V$152:AH161)),COLUMNS($V$152:AH161))","v":{"$error":"#NUM!"}},{"$f":"INDEX($T$8:$AM$112,SMALL(IF(COUNTIF($T$5,$T$8:$AM$112),MATCH(ROW($T$8:$AM$112),ROW($T$8:$AM$112)),\"\"),ROWS($V$152:AI161)),COLUMNS($V$152:AI161))","v":{"$error":"#NUM!"}},{"$f":"INDEX($T$8:$AM$112,SMALL(IF(COUNTIF($T$5,$T$8:$AM$112),MATCH(ROW($T$8:$AM$112),ROW($T$8:$AM$112)),\"\"),ROWS($V$152:AJ161)),COLUMNS($V$152:AJ161))","v":{"$error":"#NUM!"}},{"$f":"INDEX($T$8:$AM$112,SMALL(IF(COUNTIF($T$5,$T$8:$AM$112),MATCH(ROW($T$8:$AM$112),ROW($T$8:$AM$112)),\"\"),ROWS($V$152:AK161)),COLUMNS($V$152:AK161))","v":{"$error":"#NUM!"}},{"$f":"INDEX($T$8:$AM$112,SMALL(IF(COUNTIF($T$5,$T$8:$AM$112),MATCH(ROW($T$8:$AM$112),ROW($T$8:$AM$112)),\"\"),ROWS($V$152:AL161)),COLUMNS($V$152:AL161))","v":{"$error":"#NUM!"}},{"$f":"INDEX($T$8:$AM$112,SMALL(IF(COUNTIF($T$5,$T$8:$AM$112),MATCH(ROW($T$8:$AM$112),ROW($T$8:$AM$112)),\"\"),ROWS($V$152:AM161)),COLUMNS($V$152:AM161))","v":{"$error":"#NUM!"}},{"$f":"INDEX($T$8:$AM$112,SMALL(IF(COUNTIF($T$5,$T$8:$AM$112),MATCH(ROW($T$8:$AM$112),ROW($T$8:$AM$112)),\"\"),ROWS($V$152:AN161)),COLUMNS($V$152:AN161))","v":{"$error":"#NUM!"}},{"$f":"INDEX($T$8:$AM$112,SMALL(IF(COUNTIF($T$5,$T$8:$AM$112),MATCH(ROW($T$8:$AM$112),ROW($T$8:$AM$112)),\"\"),ROWS($V$152:AO161)),COLUMNS($V$152:AO161))","v":{"$error":"#NUM!"}}]
["",null,"",null,"$",null,null,null,null,null,null,null,null,null,null,"$",null,null,null,{"$f":"INDEX($T$8:$AM$112,SMALL(IF(COUNTIF($T$5,$T$8:$AM$112),MATCH(ROW($T$8:$AM$112),ROW($T$8:$AM$112)),\"\"),ROWS(V$152:$V162)),COLUMNS(V$152:$V162))","v":{"$error":"#NUM!"}},{"$f":"INDEX($T$8:$AM$112,SMALL(IF(COUNTIF($T$5,$T$8:$AM$112),MATCH(ROW($T$8:$AM$112),ROW($T$8:$AM$112)),\"\"),ROWS($V$152:W162)),COLUMNS($V$152:W162))","v":{"$error":"#NUM!"}},{"$f":"INDEX($T$8:$AM$112,SMALL(IF(COUNTIF($T$5,$T$8:$AM$112),MATCH(ROW($T$8:$AM$112),ROW($T$8:$AM$112)),\"\"),ROWS($V$152:X162)),COLUMNS($V$152:X162))","v":{"$error":"#NUM!"}},{"$f":"INDEX($T$8:$AM$112,SMALL(IF(COUNTIF($T$5,$T$8:$AM$112),MATCH(ROW($T$8:$AM$112),ROW($T$8:$AM$112)),\"\"),ROWS($V$152:Y162)),COLUMNS($V$152:Y162))","v":{"$error":"#NUM!"}},{"$f":"INDEX($T$8:$AM$112,SMALL(IF(COUNTIF($T$5,$T$8:$AM$112),MATCH(ROW($T$8:$AM$112),ROW($T$8:$AM$112)),\"\"),ROWS($V$152:Z162)),COLUMNS($V$152:Z162))","v":{"$error":"#NUM!"}},{"$f":"INDEX($T$8:$AM$112,SMALL(IF(COUNTIF($T$5,$T$8:$AM$112),MATCH(ROW($T$8:$AM$112),ROW($T$8:$AM$112)),\"\"),ROWS($V$152:AA162)),COLUMNS($V$152:AA162))","v":{"$error":"#NUM!"}},{"$f":"INDEX($T$8:$AM$112,SMALL(IF(COUNTIF($T$5,$T$8:$AM$112),MATCH(ROW($T$8:$AM$112),ROW($T$8:$AM$112)),\"\"),ROWS($V$152:AB162)),COLUMNS($V$152:AB162))","v":{"$error":"#NUM!"}},{"$f":"INDEX($T$8:$AM$112,SMALL(IF(COUNTIF($T$5,$T$8:$AM$112),MATCH(ROW($T$8:$AM$112),ROW($T$8:$AM$112)),\"\"),ROWS($V$152:AC162)),COLUMNS($V$152:AC162))","v":{"$error":"#NUM!"}},{"$f":"INDEX($T$8:$AM$112,SMALL(IF(COUNTIF($T$5,$T$8:$AM$112),MATCH(ROW($T$8:$AM$112),ROW($T$8:$AM$112)),\"\"),ROWS($V$152:AD162)),COLUMNS($V$152:AD162))","v":{"$error":"#NUM!"}},{"$f":"INDEX($T$8:$AM$112,SMALL(IF(COUNTIF($T$5,$T$8:$AM$112),MATCH(ROW($T$8:$AM$112),ROW($T$8:$AM$112)),\"\"),ROWS($V$152:AE162)),COLUMNS($V$152:AE162))","v":{"$error":"#NUM!"}},{"$f":"INDEX($T$8:$AM$112,SMALL(IF(COUNTIF($T$5,$T$8:$AM$112),MATCH(ROW($T$8:$AM$112),ROW($T$8:$AM$112)),\"\"),ROWS($V$152:AF162)),COLUMNS($V$152:AF162))","v":{"$error":"#NUM!"}},{"$f":"INDEX($T$8:$AM$112,SMALL(IF(COUNTIF($T$5,$T$8:$AM$112),MATCH(ROW($T$8:$AM$112),ROW($T$8:$AM$112)),\"\"),ROWS($V$152:AG162)),COLUMNS($V$152:AG162))","v":{"$error":"#NUM!"}},{"$f":"INDEX($T$8:$AM$112,SMALL(IF(COUNTIF($T$5,$T$8:$AM$112),MATCH(ROW($T$8:$AM$112),ROW($T$8:$AM$112)),\"\"),ROWS($V$152:AH162)),COLUMNS($V$152:AH162))","v":{"$error":"#NUM!"}},{"$f":"INDEX($T$8:$AM$112,SMALL(IF(COUNTIF($T$5,$T$8:$AM$112),MATCH(ROW($T$8:$AM$112),ROW($T$8:$AM$112)),\"\"),ROWS($V$152:AI162)),COLUMNS($V$152:AI162))","v":{"$error":"#NUM!"}},{"$f":"INDEX($T$8:$AM$112,SMALL(IF(COUNTIF($T$5,$T$8:$AM$112),MATCH(ROW($T$8:$AM$112),ROW($T$8:$AM$112)),\"\"),ROWS($V$152:AJ162)),COLUMNS($V$152:AJ162))","v":{"$error":"#NUM!"}},{"$f":"INDEX($T$8:$AM$112,SMALL(IF(COUNTIF($T$5,$T$8:$AM$112),MATCH(ROW($T$8:$AM$112),ROW($T$8:$AM$112)),\"\"),ROWS($V$152:AK162)),COLUMNS($V$152:AK162))","v":{"$error":"#NUM!"}},{"$f":"INDEX($T$8:$AM$112,SMALL(IF(COUNTIF($T$5,$T$8:$AM$112),MATCH(ROW($T$8:$AM$112),ROW($T$8:$AM$112)),\"\"),ROWS($V$152:AL162)),COLUMNS($V$152:AL162))","v":{"$error":"#NUM!"}},{"$f":"INDEX($T$8:$AM$112,SMALL(IF(COUNTIF($T$5,$T$8:$AM$112),MATCH(ROW($T$8:$AM$112),ROW($T$8:$AM$112)),\"\"),ROWS($V$152:AM162)),COLUMNS($V$152:AM162))","v":{"$error":"#NUM!"}},{"$f":"INDEX($T$8:$AM$112,SMALL(IF(COUNTIF($T$5,$T$8:$AM$112),MATCH(ROW($T$8:$AM$112),ROW($T$8:$AM$112)),\"\"),ROWS($V$152:AN162)),COLUMNS($V$152:AN162))","v":{"$error":"#NUM!"}},{"$f":"INDEX($T$8:$AM$112,SMALL(IF(COUNTIF($T$5,$T$8:$AM$112),MATCH(ROW($T$8:$AM$112),ROW($T$8:$AM$112)),\"\"),ROWS($V$152:AO162)),COLUMNS($V$152:AO162))","v":{"$error":"#NUM!"}}]
["",null,"",null,"$",null,null,null,null,null,null,null,null,null,null,"$",null,null,null,{"$f":"INDEX($T$8:$AM$112,SMALL(IF(COUNTIF($T$5,$T$8:$AM$112),MATCH(ROW($T$8:$AM$112),ROW($T$8:$AM$112)),\"\"),ROWS(V$152:$V163)),COLUMNS(V$152:$V163))","v":{"$error":"#NUM!"}},{"$f":"INDEX($T$8:$AM$112,SMALL(IF(COUNTIF($T$5,$T$8:$AM$112),MATCH(ROW($T$8:$AM$112),ROW($T$8:$AM$112)),\"\"),ROWS($V$152:W163)),COLUMNS($V$152:W163))","v":{"$error":"#NUM!"}},{"$f":"INDEX($T$8:$AM$112,SMALL(IF(COUNTIF($T$5,$T$8:$AM$112),MATCH(ROW($T$8:$AM$112),ROW($T$8:$AM$112)),\"\"),ROWS($V$152:X163)),COLUMNS($V$152:X163))","v":{"$error":"#NUM!"}},{"$f":"INDEX($T$8:$AM$112,SMALL(IF(COUNTIF($T$5,$T$8:$AM$112),MATCH(ROW($T$8:$AM$112),ROW($T$8:$AM$112)),\"\"),ROWS($V$152:Y163)),COLUMNS($V$152:Y163))","v":{"$error":"#NUM!"}},{"$f":"INDEX($T$8:$AM$112,SMALL(IF(COUNTIF($T$5,$T$8:$AM$112),MATCH(ROW($T$8:$AM$112),ROW($T$8:$AM$112)),\"\"),ROWS($V$152:Z163)),COLUMNS($V$152:Z163))","v":{"$error":"#NUM!"}},{"$f":"INDEX($T$8:$AM$112,SMALL(IF(COUNTIF($T$5,$T$8:$AM$112),MATCH(ROW($T$8:$AM$112),ROW($T$8:$AM$112)),\"\"),ROWS($V$152:AA163)),COLUMNS($V$152:AA163))","v":{"$error":"#NUM!"}},{"$f":"INDEX($T$8:$AM$112,SMALL(IF(COUNTIF($T$5,$T$8:$AM$112),MATCH(ROW($T$8:$AM$112),ROW($T$8:$AM$112)),\"\"),ROWS($V$152:AB163)),COLUMNS($V$152:AB163))","v":{"$error":"#NUM!"}},{"$f":"INDEX($T$8:$AM$112,SMALL(IF(COUNTIF($T$5,$T$8:$AM$112),MATCH(ROW($T$8:$AM$112),ROW($T$8:$AM$112)),\"\"),ROWS($V$152:AC163)),COLUMNS($V$152:AC163))","v":{"$error":"#NUM!"}},{"$f":"INDEX($T$8:$AM$112,SMALL(IF(COUNTIF($T$5,$T$8:$AM$112),MATCH(ROW($T$8:$AM$112),ROW($T$8:$AM$112)),\"\"),ROWS($V$152:AD163)),COLUMNS($V$152:AD163))","v":{"$error":"#NUM!"}},{"$f":"INDEX($T$8:$AM$112,SMALL(IF(COUNTIF($T$5,$T$8:$AM$112),MATCH(ROW($T$8:$AM$112),ROW($T$8:$AM$112)),\"\"),ROWS($V$152:AE163)),COLUMNS($V$152:AE163))","v":{"$error":"#NUM!"}},{"$f":"INDEX($T$8:$AM$112,SMALL(IF(COUNTIF($T$5,$T$8:$AM$112),MATCH(ROW($T$8:$AM$112),ROW($T$8:$AM$112)),\"\"),ROWS($V$152:AF163)),COLUMNS($V$152:AF163))","v":{"$error":"#NUM!"}},{"$f":"INDEX($T$8:$AM$112,SMALL(IF(COUNTIF($T$5,$T$8:$AM$112),MATCH(ROW($T$8:$AM$112),ROW($T$8:$AM$112)),\"\"),ROWS($V$152:AG163)),COLUMNS($V$152:AG163))","v":{"$error":"#NUM!"}},{"$f":"INDEX($T$8:$AM$112,SMALL(IF(COUNTIF($T$5,$T$8:$AM$112),MATCH(ROW($T$8:$AM$112),ROW($T$8:$AM$112)),\"\"),ROWS($V$152:AH163)),COLUMNS($V$152:AH163))","v":{"$error":"#NUM!"}},{"$f":"INDEX($T$8:$AM$112,SMALL(IF(COUNTIF($T$5,$T$8:$AM$112),MATCH(ROW($T$8:$AM$112),ROW($T$8:$AM$112)),\"\"),ROWS($V$152:AI163)),COLUMNS($V$152:AI163))","v":{"$error":"#NUM!"}},{"$f":"INDEX($T$8:$AM$112,SMALL(IF(COUNTIF($T$5,$T$8:$AM$112),MATCH(ROW($T$8:$AM$112),ROW($T$8:$AM$112)),\"\"),ROWS($V$152:AJ163)),COLUMNS($V$152:AJ163))","v":{"$error":"#NUM!"}},{"$f":"INDEX($T$8:$AM$112,SMALL(IF(COUNTIF($T$5,$T$8:$AM$112),MATCH(ROW($T$8:$AM$112),ROW($T$8:$AM$112)),\"\"),ROWS($V$152:AK163)),COLUMNS($V$152:AK163))","v":{"$error":"#NUM!"}},{"$f":"INDEX($T$8:$AM$112,SMALL(IF(COUNTIF($T$5,$T$8:$AM$112),MATCH(ROW($T$8:$AM$112),ROW($T$8:$AM$112)),\"\"),ROWS($V$152:AL163)),COLUMNS($V$152:AL163))","v":{"$error":"#NUM!"}},{"$f":"INDEX($T$8:$AM$112,SMALL(IF(COUNTIF($T$5,$T$8:$AM$112),MATCH(ROW($T$8:$AM$112),ROW($T$8:$AM$112)),\"\"),ROWS($V$152:AM163)),COLUMNS($V$152:AM163))","v":{"$error":"#NUM!"}},{"$f":"INDEX($T$8:$AM$112,SMALL(IF(COUNTIF($T$5,$T$8:$AM$112),MATCH(ROW($T$8:$AM$112),ROW($T$8:$AM$112)),\"\"),ROWS($V$152:AN163)),COLUMNS($V$152:AN163))","v":{"$error":"#NUM!"}},{"$f":"INDEX($T$8:$AM$112,SMALL(IF(COUNTIF($T$5,$T$8:$AM$112),MATCH(ROW($T$8:$AM$112),ROW($T$8:$AM$112)),\"\"),ROWS($V$152:AO163)),COLUMNS($V$152:AO163))","v":{"$error":"#NUM!"}}]
["Self- Perform Subtotal (Must not Exceed 20% of Total Amount)",null,null,null,null,null,null,null,null,null,null,"Percent of Total:",{"$f":"IFERROR(Q160/(Q160+Q114),\"\")","v":""},null,null,"Not to Exceed",{"$f":"Q148","v":0},null,null,null,null,null,null,null,null,null,null,null,null,null,null,null,null,null,null,null,null,null,null,null,null,null,null,null,null,null,null,null,null,null,"Add sep total for Laborer"]
[null,null,null,null,null,null,null,null,null,null,null,null,null,null,null,null,null,null,null,null,null,null,null,null,null,null,null,null,null,null,null,null,null,null,null,null,null,null,null,null,null,null,null,null,null,null,null,null,null,null,"Same for GMP"]
[null,null,null,null,null,null,null,null,null,null,null,null,null,null,null,"Total Amount",{"$f":"Q160+Q114+Q144","v":0}]
[null,null,null,null,null,null,null,null,null,null,null,null,null,null,null,null,null,null,null,null,{"$f":"IF(OR($M$160=\"\",$M$160<0.2),FALSE,TRUE)","v":false}]
["Detail the Reason Self-Performed Total Exceeds 20%"]
[]
[]
[]
[]
[]
[]
["B.2. CM General Conditions"]
[]
["Description",null,null,null,null,null,null,null,null,null,null,null,null,null,null,null,"Amount"]
[null,null,null,null,null,null,null,null,null,null,null,null,null,null,null,null,null,null,null,null,null,null,null,null,null,null,null,null,null,null,null,null,null,null,null,null,null,null,null,null,null,null,null,null,null,null,null,null,null,"*"]
["Temp Protection",null,null,null,null,null,null,null,null,null,null,null,null,null,null,null,0]
["Dumpsters",null,null,null,null,null,null,null,null,null,null,null,null,null,null,null,0]
["Safety",null,null,null,null,null,null,null,null,null,null,null,null,null,null,null,0]
["Signage",null,null,null,null,null,null,null,null,null,null,null,null,null,null,null,0]
["IT Consumables",null,null,null,null,null,null,null,null,null,null,null,null,null,null,null,0]
["Progress/Final cleaning",null,null,null,null,null,null,null,null,null,null,null,null,null,null,null,0]
[null,null,null,null,null,null,null,null,null,null,null,null,null,null,null,null,0]
[null,null,null,null,null,null,null,null,null,null,null,null,null,null,null,null,0]
[null,null,null,null,null,null,null,null,null,null,null,null,null,null,null,null,0]
[null,null,null,null,null,null,null,null,null,null,null,null,null,null,null,null,0]
[null,null,null,null,null,null,null,null,null,null,null,null,null,null,null,null,0]
[null,null,null,null,null,null,null,null,null,null,null,null,null,null,null,null,0]
[]
["Subtotal of General Conditions",null,null,null,null,null,null,null,null,null,null,null,null,null,null,null,{"$f":"SUBTOTAL(9,Q175:R187)","v":0}]
[]
[]
[]
[]
[]
[]
[]
[]
[]
["Insurance Costs will be $ per One Thousand $ ($1,000)",null,null,null,null,null,null,null,null,null,null,null,null,null,null,0,{"$f":"Q210*P198/1000","v":0},null,null,null,null,null,null,null,null,null,null,null,null,null,null,null,null,null,null,null,null,null,null,null,null,null,null,null,null,null,null,null,null,"*"]
["Subtotal",null,null,null,null,null,null,null,null,null,null,null,null,null,null,{"$f":"Q198+Q210","v":0}]
["Performance and Payment Bond Cost will be $ per One Thousand $ ($1,000)",null,null,null,null,null,null,null,"First ",2500000,0,"Balance",null,0,null,null,{"$f":"IF(P199>J200,(((K200*J200)/1000))+(((P199-J200)*N200)/1000),(P199*K200)/1000)","v":0}]
["Subtotal",null,null,null,null,null,null,null,null,null,null,null,null,null,null,{"$f":"Q200+P199","v":0}]
["Total General Conditions Costs",null,null,null,null,null,null,null,null,null,null,null,null,null,null,null,{"$f":"Q188+Q198+Q200","v":0}]
[]
["B.1 Trades",null,null,null,null,null,null,null,null,null,null,null,null,null,null,null,{"$f":"Q162","v":0}]
["B.2 Subtotal General Conditions (excludes insurance and bonds)",null,null,null,null,null,null,null,null,null,null,null,null,null,null,null,{"$f":"Q188","v":0}]
["B.3. Pre-Construction",null,null,null,null,null,null,null,null,null,null,null,null,null,null,null,{"$f":"O226","v":0}]
["B.3. Construction",null,null,null,null,null,null,null,null,null,null,null,null,null,null,null,{"$f":"O250","v":0}]
["B.4.1 Pre-Construction Fee",null,null,null,null,null,null,null,null,null,null,null,null,null,null,null,{"$f":"Q274","v":0}]
["B.4.2 Construction Fee",null,null,null,null,null,null,null,null,null,null,null,null,null,null,null,{"$f":"Q283","v":0}]
["Subtotal ",null,null,null,null,null,null,null,null,null,null,null,null,null,null,null,{"$f":"SUM(Q204:R209)+Q271","v":0}]
[]
["B.3 Construction Manager Personnel Costs"]
[]
["Pre-Construction"]
[]
["Title/Name",null,null,null,null,null,null,"Hourly Rate",null,null,null,"Total Hours",null,null,"Extended Amount",null,null,null,null,null,null,null,null,null,null,null,null,null,null,null,null,null,null,null,null,null,null,null,null,null,null,null,null,null,null,null,null,null,null,"*"]
[]
[null,null,null,null,null,null,null,0,null,null,null,0,null,null,{"$f":"H218*L218","v":0}]
[null,null,null,null,null,null,null,0,null,null,null,0,null,null,0]
[null,null,null,null,null,null,null,0,null,null,null,0,null,null,0]
[null,null,null,null,null,null,null,0,null,null,null,0,null,null,0]
[null,null,null,null,null,null,null,0,null,null,null,0,null,null,0]
[null,null,null,null,null,null,null,0,null,null,null,0,null,null,0]
[null,null,null,null,null,null,null,0,null,null,null,0,null,null,{"$f":"H224*L224","v":0}]
[]
["Subtotal",null,null,null,null,null,null,null,null,null,null,null,null,null,{"$f":"SUBTOTAL(9,O218:P225)","v":0}]
[]
[]
[]
[]
[]
[]
[]
[]
[]
[]
[]
["Construction"]
[]
["Title/Name",null,null,null,null,null,null,"Hourly Rate",null,null,null,"Total Hours",null,null,"Extended Amount",null,null,null,null,null,null,null,null,null,null,null,null,null,null,null,null,null,null,null,null,null,null,null,null,null,null,null,null,null,null,null,null,null,null,"*"]
[]
[null,null,null,null,null,null,null,0,null,null,null,null,null,null,{"$f":"H242*L242","v":0}]
[null,null,null,null,null,null,null,0,null,null,null,0,null,null,0]
[null,null,null,null,null,null,null,0,null,null,null,0,null,null,0]
[null,null,null,null,null,null,null,0,null,null,null,0,null,null,0]
[null,null,null,null,null,null,null,0,null,null,null,0,null,null,0]
[null,null,null,null,null,null,null,0,null,null,null,0,null,null,0]
[null,null,null,null,null,null,null,0,null,null,null,0,null,null,0]
[]
["Subtotal",null,null,null,null,null,null,null,null,null,null,null,null,null,{"$f":"SUBTOTAL(9,O242:P249)","v":0}]
["Total Pre-Construction and Construction Personnel Costs",null,null,null,null,null,null,null,null,null,null,"Not to Exceed",null,null,{"$f":"O250+O226","v":0}]
[]
[]
[]
[]
[]
[]
[]
[]
[]
[]
[]
[]
[]
["B.4.CM Fee"]
["Pre-Construction - Fee is based upon",null,null,null,null,null,null,null,null,0.04,"of Total Pre-Construction Personnel Costs and Pre-Construction Reimbursable Values"]
[]
["Pre-Construction Fee",null,null,null,null,null,null,null,null,null,null,null,null,null,null,null,"Amount",null,null,null,null,null,null,null,null,null,null,null,null,null,null,null,null,null,null,null,null,null,null,null,null,null,null,null,null,null,null,null,null,"*"]
["Pre-Construction Personnel Costs from Section B.3.1 Construction Manager Personnel Costs",null,null,null,null,null,null,null,null,null,null,null,null,null,null,null,{"$f":"O226","v":0}]
["Pre-Construction Reimbursable Values",null,null,null,null,null,null,null,null,null,null,null,null,null,null,null,0]
["Pre-Purchase Equipment",null,null,null,null,null,null,null,null,null,null,null,null,null,null,null,0]
["Subtotal",null,null,null,null,null,null,null,null,null,null,null,null,null,null,null,{"$f":"Q269+Q270+Q271","v":0},null,null,null,null,null,null,null,null,null,null,null,null,null,null,null,null,null,null,null,null,null,null,null,null,null,null,null,null,null,null,null,null,"Pre-Purchase Equipment (Contractor edits)"]
["Subtotal Above Multiplied by CM Pre-Construction Fee of ",null,null,null,null,null,null,null,null,null,{"$f":"J266","v":0.04},null,null,null,null,null,{"$f":"Q272*K273","v":0}]
["Total CM Pre-Construction Fee                                                                                                                         ",null,null,null,null,null,null,null,null,null,null,null,null,null,null,"Not to Exceed",{"$f":"Q273","v":0}]
[]
[]
["Construction - Fee is based upon",null,null,null,null,null,null,null,null,0.04,"of Total Trade Contractor Costs"]
[]
["Construction Fee",null,null,null,null,null,null,null,null,null,null,null,null,null,null,null,"Amount",null,null,null,null,null,null,null,null,null,null,null,null,null,null,null,null,null,null,null,null,null,null,null,null,null,null,null,null,null,null,null,null,"*"]
["Trade Contract Costs from Section B.1 CSI Cost Estimate Summary Trade Amount",null,null,null,null,null,null,null,null,null,null,null,null,null,null,null,{"$f":"Q162","v":0}]
["Subtotal",null,null,null,null,null,null,null,null,null,null,null,null,null,null,null,{"$f":"Q280","v":0}]
["Subtotal Above Multiplied by CM Construction Fee of ",null,null,null,null,null,null,null,null,null,{"$f":"J277","v":0.04},null,null,null,null,null,{"$f":"Q281*K282","v":0}]
["Total CM Construction Fee                                                                                                                ",null,null,null,null,null,null,null,null,null,null,null,null,null,null,"Not to Exceed",{"$f":"Q282","v":0}]
[]
["Total Pre-Construction and Construction Fee",null,null,null,null,null,null,null,null,null,null,null,null,null,"Total Not to Exceed",null,{"$f":"Q283+Q274","v":0}]
[]
[]
["CM Fixed Limit of Construction Cost Summary"]
[]
["B.1 CSI Cost Estimate Summary",null,null,null,null,null,null,null,null,null,null,null,null,null,null,null,{"$f":"Q162","v":0}]
["B.2 CM General Conditions Total",null,null,null,null,null,null,null,null,null,null,null,null,null,null,null,{"$f":"Q202","v":0}]
["B.3 CM Pre-Construction",null,null,null,null,null,null,null,null,null,null,null,null,null,null,null,{"$f":"O226","v":0}]
["B.3 CM Construction Personnel Costs Total ",null,null,null,null,null,null,null,null,null,null,null,null,null,null,null,{"$f":"O250","v":0}]
["B.4 CM Fee Total",null,null,null,null,null,null,null,null,null,null,null,null,null,null,null,{"$f":"Q285","v":0}]
["Pre-Construction Reimbursable Values and Pre-Purchase Equipment",null,null,null,null,null,null,null,null,null,null,null,null,null,null,null,{"$f":"Q270+Q271","v":0}]
["CM Construction Contingency ( % of Construction Cost B.1)",null,null,null,null,null,null,null,0,null,null,null,null,null,null,null,{"$f":"I296*Q290","v":0}]
["B.5 CM Costs Total (Sum of B.2, B.3, B.4, CM Construction Contingency, Pre-Construction Reimbursable Values and Pre-Purchase Equipment)",null,null,null,null,null,null,null,null,null,null,null,null,null,null,null,{"$f":"Q291+Q292+Q294+Q296+Q295+Q293","v":0}]
["Combined Trade Contractor Bid Summary and Construction Manager Costs: "]
["FIXED LIMIT OF CONSTRUCTION COST (Sum of B.1 and B.5)",null,null,null,null,null,null,null,null,null,null,null,null,null,"Grand Total Not to Exceed",null,{"$f":"Q290+Q297","v":0}]
[]
[]
[]
[]
[]
[]
[]
[]
[]
[]
[]
[]
[]
[]
[]
[]
[]
[]
[]
[]
[]
[]
[]
[]
[]
[]
[]
[]
[]
[]
[]
[]
[]
[]
[]
[]
[]
[]
[]
[]
[]
[]
[]
[]
[]
[]
[]
[]
[]
[]
[]
[]
[]
[]
[]
[]
[]
[]
[]
[]
[]
[]
[]
[]
[]
[]
[]
[]
[]
[]
[]
[]
[]
[]
[]
[]
[]
[]
[]
[]
[]
[]
[]
[]
[]
[]
[]
[]
[]
[]
[]
[]
[]
[]
[]
[]
[]
[]
[]
[]
[]
[]
[]
[]
[]
[]
[]
[]
[]
[]
[]
[]
[]
[]
[]
[]
[]
[]
[]
[]
[]
[]
[]
[]
[]
[]
[]
[]
[]
[]
[]
[]
[]
[]
[]
[]
[]
[]
[]
[]
[]
[]
[]
[]
[]
[]
[]
[]
[]
[]
[]
[]
[]
[]
[]
[]
[]
[]
[]
[]
[]
[]
[]
[]
[]
[]
[]
[]
[]
[]
[]
[]
[]
[]
[]
[]
[]
[]
[]
[]
[]
[]
[]
[]
[]
[]
[]
[]
[]
[]
[]
[]
[]
[]
[]
[]
[]
[]
[]
[]
[]
[]
[]
[null,null,null,null,null,null,null,null,null,null,null,null,null,null,null,null,0]
[null,null,null,null,null,null,null,0,null,null,null,0,null,null,{"$f":"H504*L504","v":0}]
[null,null,null,null,null,null,null,0,null,null,null,0,null,null,{"$f":"H505*L505","v":0}]

{"sheet":"GMP Instructions","index":3,"n_rows":44,"n_cols":16,"rows_kept":44,"cut":false,"hidden":false,"merged":[[21,0,21,2],[0,15,0,16],[1,0,1,2],[4,0,4,8],[6,0,6,17],[9,0,9,3],[10,1,10,8],[12,0,12,6],[13,1,13,13],[16,1,16,9],[17,1,17,8],[19,1,19,10],[22,1,22,12],[27,0,27,1],[31,1,31,8],[33,0,33,3],[34,1,34,8],[24,0,24,1],[25,1,25,12]]}
[null,null,null,null,null,null,null,null,null,null," = to be completed by CM",null,null,null,null,{"$f":"'FLCC Instructions'!P1","v":"Rev. 6/14/24"}]
["GMP Proposal",null,null,null,null,null,null,null,null,null," = predetermined or automatic calculation"]
[]
[]
["Section C.1. Trade Contractors Bid Summary - Instructions for Completion"]
[]
["Proposals for Trade Contractor work and Self-Performed work (Not to Exceed 20% of Total) must be detailed and summarized per the following \"column\" instructions:"]
[]
[]
["Scope/Trade Category"]
[null,"• List all applicable Trade Categories in sequential order by CSI Numbers."]
[]
["Proposed Trade Contractor, Self-Perform Bids"]
[null,"• List all bidders that were provided a bidding document in order of bid results from lowest to highest proposed amounts"]
[null,"(If the trade contractor selected at FLCC has changed at GMP, provide detail explanation in Contractor Scope/Trade Detail)"]
[null,"• A minimum of three (3) bidders are required per trade category. If there are less than 3 bidders, provide detail explanation in Contractor Scope/Trade Detail"]
[null,"• Bidders that do not provide a bid response select \"No Response\" in drop down menu"]
[null,"• Bidders that responded but provide No Bid select \"Decline to Bid\" in drop down menu"]
[null,"• Self-Perform Work, please check box \"Self Perform\", If it exceeds 20%, provide explanation in Detail the Reason Self-Performed Total Exceeds 20%"]
[null,"(Note Self-Perform detail will automatically load in Self-Perform section below CSI Cost Estimate Summary)"]
[]
["Proposed Amounts"]
[null,"• List bid amounts from lowest to highest on the basis of base bid including intended alternates to be awarded."]
[]
["Estimate"]
[null,"• Estimates are not allowed on the GMP."]
[]
["Selected Firm"]
[null,"• Automatically selected based on the lowest bid amount from the lowest entered Proposed Trade column. "]
[]
["EMR"]
[null,"• Enter the most current EMR for each Trade Contractor submitting a proposal."]
[]
["Intended Awardee Proposal Detail"]
[null,"• Enter intended base bid and accepted alternate amounts to be awarded."]
[]
["Total"]
[null,"•Automatically entered from Intended Awardee Proposal column  as a lump sum including accepted alternates."]
[]
["Trade Contractor Total including any Self-Perform Amounts (Not to Exceed 20% of Total)"]
[null,"• This amount must reflect the sum of all totals in the last column"]
[]
["Full Time Laborer "]
[null,"• If a full time laborer is contractually required, their time should be entered into this section. "]

{"sheet":"GMP Exhibit C","index":4,"n_rows":117,"n_cols":11,"rows_kept":117,"cut":false,"hidden":false,"merged":[[6,0,6,1],[10,4,10,5],[11,4,11,6],[11,8,11,9],[16,0,16,1],[16,4,16,7],[36,0,37,1],[36,2,39,10],[17,4,17,7],[18,4,18,7],[18,8,18,9],[19,4,19,5],[19,6,19,7],[19,8,19,9],[20,4,20,5],[23,4,23,6],[23,8,23,10],[28,4,28,5],[32,4,32,5],[42,3,42,10],[43,3,43,10],[44,3,44,10],[87,1,87,2],[88,1,88,2],[88,3,88,10],[116,2,116,7],[90,1,90,2],[90,3,90,10],[92,1,92,2],[92,3,92,10],[94,3,94,10],[96,1,96,2],[96,3,96,5],[101,3,102,10],[108,2,108,7],[110,2,110,7],[112,2,112,7],[114,2,114,7]]}
[null,null,null,null,null,null,null,null,null,null,{"$f":"'FLCC Instructions'!P1","v":"Rev. 6/14/24"}]
[null,null,null,null,null,null,null," = to be completed by Construction Manager"]
[null,null,null,null,null,null,null," = predetermined or automatic calculation"]
[]
[]
[]
["Exhibit C"]
[]
["PROPOSAL FOR GUARANTEED MAXIMUM PRICE (GMP)"]
[]
["In accordance with the terms of AEC-Department Contract # ",null,null,null,{"$f":"IF(E12=\"A.Z.Shmina\",List!B1,IF('GMP Exhibit C'!E12:G12=\"Kasco, Inc.\",List!B2,IF(E12=\"Commercial Contracting Corporation\",List!B3,IF(E12=\"Ideal Contracting LLC\",List!B4,0))))","v":0},null,"for CM Services for Small Projects"]
["between The Regents of the University of Michigan and",null,null,null,null,null,null,", dated","2023-08-01",null,"the following"]
["GMP proposal is submitted for:"]
[]
[]
[]
["PROJECT:",null,"BUILDING NAME:"]
[null,null,"BUILDING No. "]
[null,null,"PROJECT DESCRIPTION:"]
[]
[null,null,"U-M PROJECT NO. "]
[]
[]
["Submitted via Email to:",null,null,"Design/Project Manager:",null,null,null,"Email:"]
[]
[]
[]
[]
[null,null,null,"Date Submitted:"]
[]
[]
[]
[null,"Guaranteed Maximum Price:",null,"Lump Sum $",{"$f":"'GMP Trade Contractor Bid Sum'!Q298","v":0}]
[]
[]
[]
["Description of Work:"]
[]
[]
[]
[]
[]
[null,null,"Submitted By: ",{"$f":"E12","v":0}]
[null,null,"Address "]
[]
[]
[null,null,null,null,null,null,null,null," = to be completed by Contractor"]
[null,null,null,null,null,null,null,null," = predetermined or automatic calculation"]
[]
[]
["CONSTRUCTION COST SUMMARY"]
["The Construction Manager has performed due diligence to obtain market-competitive overall project costs and has"]
["based the GMP on the attached summary of cost for the Owner's review (GMP Proposal - Exhibit C)."]
[]
["Note: The Owner reserves the right to have a third party review construction costs provided by the Construction Manager and"]
["to require a review of these costs with the Construction Manager prior to acceptance of the proposal."]
[]
[]
[]
["TIME OF COMPLETION"]
["When Notice to Proceed is issued by the Owner within 30 days of proposal submittal, the undersigned agrees to"]
["schedule and coordinate construction operations to achieve Substantial Completion, in accordance with Article 8.3 of the"]
["Standard General Conditions Applicable to Projects Where the Owner has Retained the Professional Services of "]
["Construction Manager (10/30/16; Rev 6/18, 8/21, 2/24), by the following date:"]
[null,null,null,null,null,"Substantial Completion date"]
[]
["EXCLUSION / EXCEPTIONS"]
["The Construction Manager agrees to construct the project in full accordance with all plans and specifications"]
["provided by the Design Professional. The following exclusions and/or exceptions are noted with this proposal:"]
[]
[]
[]
[]
[]
["** To add rows: Click - New Row** "]
[]
[]
["Note:"]
[null,"• It is understood that the Owner reserves the right to decline this proposal where exclusions / exceptions"]
[null,"are in conflict with the design standards, code requirements or execution strategy required by the"]
[null,"Contract Documents."]
[null,"• It is understood that the Owner reserves the right to decline all bids for this project at will, regardless of"]
[null,"cause."]
[]
["CONTRACT DOCUMENTS"]
["Contract Documents for this project include the following:"]
[]
[null,"• Plans and Specifications:"]
[null," o Designed by: "]
[]
[null," o Design Professional Job Number: "]
[]
[null," o Issued for bid date: "]
[]
[null,"• Addendum Nos.:"]
[]
[null,"• AEC-Department Contract #                   ",null,{"$f":"E11","v":0},null,null,"including all terms and conditions referenced therein."]
[]
[]
[null,"• Special Conditions included with bid documents, if any, and;"]
[]
[null,null,"•  Other (specify):"]
[]
[]
["PROPOSAL SIGNATURE"]
["The undersigned agrees to execute a contract for the Work covered by this proposal provided she/he is notified of its"]
["acceptance within thirty (30} calendar days."]
[]
[null,"Construction Manager:",{"$f":"E12","v":0}]
[]
[null,"Signature:"]
[]
[null,"Printed: "]
[]
[null,"Title:"]
[]
[null,"Date:"]

{"sheet":"GMP Trade Contractor Bid Sum","index":5,"n_rows":505,"n_cols":51,"rows_kept":505,"cut":false,"hidden":false,"merged":[[8,6,8,7],[9,2,9,3],[0,0,1,17],[4,0,6,1],[4,2,6,3],[4,4,6,4],[4,5,6,5],[4,6,6,7],[4,8,6,9],[4,10,6,11],[4,12,6,13],[4,14,6,15],[4,16,6,17],[2,16,2,17],[12,16,15,17],[13,2,13,3],[13,6,13,7],[14,2,14,3],[14,6,14,7],[15,2,15,3],[15,6,15,7],[9,6,9,7],[10,2,10,3],[10,6,10,7],[11,0,11,15],[11,16,11,17],[12,0,15,1],[12,2,12,3],[12,6,12,7],[12,10,15,11],[12,12,15,13],[7,0,10,1],[7,2,7,3],[7,6,7,7],[7,10,10,11],[7,12,10,13],[7,16,10,17],[8,2,8,3],[19,2,19,3],[19,6,19,7],[20,2,20,3],[20,6,20,7],[21,0,21,15],[21,16,21,17],[16,0,16,15],[16,16,16,17],[17,0,20,1],[17,2,17,3],[17,6,17,7],[17,10,20,11],[17,12,20,13],[17,16,20,17],[18,2,18,3],[18,6,18,7],[27,16,30,17],[22,0,25,1],[22,2,22,3],[22,6,22,7],[22,10,25,11],[22,12,25,13],[22,16,25,17],[23,2,23,3],[23,6,23,7],[24,2,24,3],[24,6,24,7],[28,2,28,3],[28,6,28,7],[29,2,29,3],[29,6,29,7],[30,2,30,3],[30,6,30,7],[25,2,25,3],[25,6,25,7],[26,0,26,15],[26,16,26,17],[27,0,30,1],[27,2,27,3],[27,6,27,7],[34,2,34,3],[34,6,34,7],[35,2,35,3],[35,6,35,7],[36,0,36,15],[36,16,36,17],[31,0,31,15],[31,16,31,17],[32,0,35,1],[32,2,32,3],[32,6,32,7],[32,10,35,11],[32,12,35,13],[32,16,35,17],[33,2,33,3],[33,6,33,7],[27,10,30,11],[27,12,30,13],[42,16,45,17],[37,0,40,1],[37,2,37,3],[37,6,37,7],[37,10,40,11],[37,12,40,13],[37,16,40,17],[38,2,38,3],[38,6,38,7],[39,2,39,3],[39,6,39,7],[43,2,43,3],[43,6,43,7],[44,2,44,3],[44,6,44,7],[45,2,45,3],[45,6,45,7],[40,2,40,3],[40,6,40,7],[41,0,41,15],[41,16,41,17],[42,0,45,1],[49,2,49,3],[49,6,49,7],[50,2,50,3],[50,6,50,7],[51,0,51,15],[51,16,51,17],[46,0,46,15],[46,16,46,17],[47,0,50,1],[47,2,47,3],[47,6,47,7],[47,10,50,11],[47,12,50,13],[47,16,50,17],[48,2,48,3],[48,6,48,7],[42,2,42,3],[42,6,42,7],[42,10,45,11],[42,12,45,13],[57,16,60,17],[52,0,55,1],[52,2,52,3],[52,6,52,7],[52,10,55,11],[52,12,55,13],[52,16,55,17],[53,2,53,3],[53,6,53,7],[54,2,54,3],[54,6,54,7],[58,2,58,3],[58,6,58,7],[59,2,59,3],[59,6,59,7],[60,2,60,3],[60,6,60,7],[55,2,55,3],[55,6,55,7],[56,0,56,15],[64,2,64,3],[64,6,64,7],[65,2,65,3],[65,6,65,7],[66,0,66,15],[66,16,66,17],[61,0,61,15],[61,16,61,17],[62,0,65,1],[62,2,62,3],[62,6,62,7],[62,10,65,11],[62,12,65,13],[62,16,65,17],[63,2,63,3],[63,6,63,7],[56,16,56,17],[57,0,60,1],[57,2,57,3],[57,6,57,7],[57,10,60,11],[57,12,60,13],[72,16,75,17],[67,0,70,1],[67,2,67,3],[67,6,67,7],[67,10,70,11],[67,12,70,13],[67,16,70,17],[68,2,68,3],[68,6,68,7],[69,2,69,3],[69,6,69,7],[73,2,73,3],[73,6,73,7],[74,2,74,3],[74,6,74,7],[75,2,75,3],[75,6,75,7],[70,2,70,3],[70,6,70,7],[71,0,71,15],[79,2,79,3],[79,6,79,7],[80,2,80,3],[80,6,80,7],[81,0,81,15],[81,16,81,17],[76,0,76,15],[76,16,76,17],[77,0,80,1],[77,2,77,3],[77,6,77,7],[77,10,80,11],[77,12,80,13],[77,16,80,17],[78,2,78,3],[78,6,78,7],[71,16,71,17],[72,0,75,1],[72,2,72,3],[72,6,72,7],[72,10,75,11],[72,12,75,13],[87,16,90,17],[82,0,85,1],[82,2,82,3],[82,6,82,7],[82,10,85,11],[82,12,85,13],[82,16,85,17],[83,2,83,3],[83,6,83,7],[84,2,84,3],[84,6,84,7],[88,2,88,3],[88,6,88,7],[89,2,89,3],[89,6,89,7],[90,2,90,3],[90,6,90,7],[85,2,85,3],[85,6,85,7],[86,0,86,15],[86,16,86,17],[87,0,90,1],[87,2,87,3],[87,6,87,7],[94,2,94,3],[94,6,94,7],[95,2,95,3],[95,6,95,7],[96,0,96,15],[96,16,96,17],[91,0,91,15],[91,16,91,17],[92,0,95,1],[92,2,92,3],[92,6,92,7],[92,10,95,11],[92,12,95,13],[92,16,95,17],[93,2,93,3],[93,6,93,7],[87,10,90,11],[87,12,90,13],[102,16,105,17],[97,0,100,1],[97,2,97,3],[97,6,97,7],[97,10,100,11],[97,12,100,13],[97,16,100,17],[98,2,98,3],[98,6,98,7],[99,2,99,3],[99,6,99,7],[103,2,103,3],[103,6,103,7],[104,2,104,3],[104,6,104,7],[105,2,105,3],[105,6,105,7],[100,2,100,3],[100,6,100,7],[101,0,101,15],[101,16,101,17],[102,0,105,1],[111,16,111,17],[106,0,106,15],[106,16,106,17],[107,0,110,1],[107,2,107,3],[107,6,107,7],[107,10,110,11],[107,12,110,13],[107,16,110,17],[108,2,108,3],[108,6,108,7],[102,2,102,3],[102,6,102,7],[102,10,105,11],[102,12,105,13],[134,2,134,3],[134,6,134,7],[135,2,135,3],[135,6,135,7],[136,0,136,15],[109,2,109,3],[109,6,109,7],[110,2,110,3],[110,6,110,7],[111,0,111,15],[136,16,136,17],[113,11,113,14],[113,16,113,17],[132,0,135,1],[132,2,132,3],[132,6,132,7],[132,10,135,11],[132,12,135,13],[132,16,135,17],[133,2,133,3],[133,6,133,7],[131,0,131,1],[131,2,131,3],[131,6,131,7],[131,8,131,9],[131,10,131,11],[131,12,131,13],[131,14,131,15],[131,16,131,17],[141,16,141,17],[143,16,143,17],[146,0,146,1],[146,2,146,3],[146,12,146,13],[137,0,140,1],[137,2,137,3],[137,6,137,7],[137,10,140,11],[137,12,140,13],[137,16,140,17],[138,2,138,3],[138,6,138,7],[139,2,139,3],[139,6,139,7],[146,16,146,17],[147,0,147,1],[147,2,147,3],[147,4,147,7],[148,0,148,1],[148,2,148,3],[148,4,148,7],[149,0,149,1],[149,2,149,3],[140,2,140,3],[140,6,140,7],[141,0,141,15],[146,4,146,7],[153,2,153,3],[153,4,153,7],[149,4,149,7],[150,0,150,1],[150,2,150,3],[150,4,150,7],[151,0,151,1],[151,2,151,3],[151,4,151,7],[158,0,158,1],[158,2,158,3],[158,4,158,7],[159,16,159,17],[161,16,161,17],[164,0,169,19],[156,0,156,1],[156,2,156,3],[156,4,156,7],[157,0,157,1],[157,2,157,3],[157,4,157,7],[147,8,158,14],[147,16,158,17],[154,0,154,1],[154,2,154,3],[154,4,154,7],[155,0,155,1],[155,2,155,3],[155,4,155,7],[152,0,152,1],[152,2,152,3],[152,4,152,7],[153,0,153,1],[174,0,174,15],[174,16,174,17],[174,20,174,21],[174,22,174,23],[175,0,175,15],[175,16,175,17],[175,20,175,21],[175,22,175,23],[170,20,170,21],[170,22,170,23],[171,20,171,21],[171,22,171,23],[172,0,173,15],[172,16,173,17],[172,20,172,21],[172,22,172,23],[173,20,173,21],[173,22,173,23],[178,22,178,23],[179,0,179,15],[179,16,179,17],[179,20,179,21],[179,22,179,23],[176,0,176,15],[176,16,176,17],[176,20,176,21],[176,22,176,23],[177,0,177,15],[177,16,177,17],[177,20,177,21],[177,22,177,23],[180,0,180,15],[180,16,180,17],[181,0,181,15],[181,16,181,17],[182,0,182,15],[182,16,182,17],[178,0,178,15],[178,16,178,17],[178,20,178,21],[187,0,187,15],[187,16,187,17],[197,0,197,14],[197,16,197,17],[198,0,198,14],[198,16,198,17],[183,0,183,15],[183,16,183,17],[184,0,184,15],[184,16,184,17],[185,0,185,15],[185,16,185,17],[202,0,202,15],[202,16,202,17],[203,0,203,15],[203,16,203,17],[204,0,204,15],[204,16,204,17],[199,16,199,17],[200,0,200,14],[200,16,200,17],[201,0,201,15],[201,16,201,17],[199,11,199,12],[199,13,199,14],[208,16,208,17],[209,0,209,15],[209,16,209,17],[215,0,216,6],[215,7,216,10],[215,11,216,13],[215,14,216,15],[205,0,205,15],[205,16,205,17],[206,0,206,15],[206,16,206,17],[207,0,207,15],[207,16,207,17],[217,0,217,6],[217,7,217,10],[217,11,217,13],[217,14,217,15],[218,0,218,6],[218,7,218,10],[218,11,218,13],[218,14,218,15],[208,0,208,15],[221,0,221,6],[221,7,221,10],[221,11,221,13],[221,14,221,15],[222,0,222,6],[222,7,222,10],[222,11,222,13],[222,14,222,15],[219,0,219,6],[219,7,219,10],[219,11,219,13],[219,14,219,15],[220,0,220,6],[220,7,220,10],[220,11,220,13],[220,14,220,15],[239,0,240,6],[239,7,240,10],[239,11,240,13],[239,14,240,15],[241,0,241,6],[241,7,241,10],[241,11,241,13],[241,14,241,15],[223,0,223,6],[223,7,223,10],[223,11,223,13],[223,14,223,15],[225,0,225,6],[225,7,225,10],[225,11,225,13],[225,14,225,15],[244,0,244,6],[244,7,244,10],[244,11,244,13],[244,14,244,15],[245,0,245,6],[245,7,245,10],[245,11,245,13],[245,14,245,15],[242,0,242,6],[242,7,242,10],[242,11,242,13],[242,14,242,15],[243,0,243,6],[243,7,243,10],[243,11,243,13],[243,14,243,15],[248,18,248,19],[249,0,249,6],[249,7,249,10],[249,11,249,13],[249,14,249,15],[250,0,250,10],[250,11,250,13],[250,14,250,15],[246,0,246,6],[246,7,246,10],[246,11,246,13],[246,14,246,15],[247,0,247,6],[247,7,247,10],[247,11,247,13],[247,14,247,15],[269,0,269,15],[269,16,269,17],[269,18,269,19],[270,16,270,17],[271,0,271,15],[271,16,271,17],[271,18,271,19],[265,18,265,19],[266,18,266,19],[267,0,267,15],[267,16,267,17],[267,18,267,19],[268,0,268,15],[268,16,268,17],[268,18,268,19],[274,18,274,19],[278,0,278,15],[278,16,278,17],[279,0,279,15],[279,16,279,17],[280,0,280,15],[280,16,280,17],[272,0,272,7],[272,10,272,15],[272,16,272,17],[272,18,272,19],[273,0,273,14],[273,16,273,17],[273,18,273,19],[289,0,289,15],[289,16,289,17],[290,0,290,15],[290,16,290,17],[291,0,291,15],[291,16,291,17],[281,0,281,7],[281,10,281,15],[281,16,281,17],[282,0,282,14],[282,16,282,17],[284,14,284,15],[284,16,284,17],[294,16,294,17],[295,16,295,17],[292,0,292,15],[292,16,292,17],[504,0,504,6],[504,7,504,10],[504,11,504,13],[504,14,504,15],[297,0,297,13],[297,14,297,15],[297,16,297,17],[502,0,502,15],[502,16,502,17],[503,0,503,6],[503,7,503,10],[503,11,503,13],[503,14,503,15],[293,0,293,15],[293,16,293,17]]}
["Trade Contractor Bid Summary - All proposals received from the Trade Contractors must follow this document in the same sequential order as noted on the following including any and all bid declinations.",null,null,null,null,null,null,null,null,null,null,null,null,null,null,null,null,null,"False",null,null,null,null,null,null,null,null,null,null,null,null,null,null,null,null,null,null,null,null,null,null,null,null,null,null,null,"Decline Bid"]
[null,null,null,null,null,null,null,null,null,null,null,null,null,null,null,null,null,null,null,null,null,null,null,null,null,null,null,null,null,null,null,null,null,null,null,null,null,null,null,null,null,null,null,null,null,null,"No Response"]
[null,null,null,null,null,null,null,null,null,null,null,null," = to be completed by Construction Manager",null,null,null,{"$f":"'FLCC Instructions'!P1","v":"Rev. 6/14/24"}]
["C.1 CSI Cost Estimate",null,null,null,null,null,null,null,null,null,null,null," = predetermined or automatic calculation"]
["Scope/Trade\n(Includes CSI #'s for clarity)",null,"Proposed Trade Contractor/Self Perform",null,"Self Perform","Decline Bid or No Response","Proposed Amounts \n(low to high)",null,"No Estimates at GMP",null,"Selected Firm",null,"EMR",null,"Intended Awardee Proposal Detail  & (accepted alternates only)",null,"Total",null,null,true]
[]
[null,null,null,null,false,null,null,null,null,null,null,null,null,null,null,null,null,null,null,null,null,null,null,null,null,null,null,null,null,null,null,null,null,null,null,null,null,null,null,null,null,null,null,null,null,null,null,null,null,"*"]
[null,null,"Name",null,false,null,0,null,false,false,{"$f":"C8","v":"Name"},null,null,null,"Base Bid",0,{"$f":"IF(S8=$S$1,SUM(P8:P11),0)","v":0},null,{"$f":"IF(E8,\"True\",\"False\")","v":"False"},{"$f":"IF($S8=\"true\",A8,\"\")","v":""},{"$f":"IF($S8=\"true\",C8,\"\")","v":""},{"$f":"IF($S8=\"true\",E8,\"\")","v":""},{"$f":"IF($S8=\"true\",\"A\",\"\")","v":""},{"$f":"IF($S8=\"true\",\"A\",\"\")","v":""},{"$f":"IF($S8=\"true\",G8,\"\")","v":""},{"$f":"IF($S8=\"true\",\"A\",\"\")","v":""},{"$f":"IF($S8=\"true\",\"A\",\"\")","v":""},{"$f":"IF($S8=\"true\",\"A\",\"\")","v":""},{"$f":"IF($S8=\"true\",K8,\"\")","v":""},{"$f":"IF($S8=\"true\",M8,\"\")","v":""},{"$f":"IF($S8=\"true\",P8,\"\")","v":""},{"$f":"IF($S8=\"true\",P9,\"\")","v":""},{"$f":"IF($S8=\"true\",P10,\"\")","v":""},{"$f":"IF($S8=\"true\",P11,\"\")","v":""},{"$f":"IF($S8=\"true\",#REF!,\"\")","v":""},{"$f":"IF($S8=\"true\",SUM(P8:P11),\"\")","v":""}]
[null,null,"Name",null,false,null,0,null,false,null,null,null,null,null,"Alternate",0,null,null,{"$f":"IF(E9,\"True\",\"False\")","v":"False"},{"$f":"IF($S9=\"true\",A9,\"\")","v":""},{"$f":"IF($S9=\"true\",C9,\"\")","v":""},{"$f":"IF($S9=\"true\",E9,\"\")","v":""},{"$f":"IF($S9=\"true\",\"A\",\"\")","v":""},"",{"$f":"IF($S9=\"true\",G9,\"\")","v":""},{"$f":"IF($S9=\"true\",\"A\",\"\")","v":""},"","",{"$f":"IF($S9=\"true\",K9,\"\")","v":""},"","","","","",{"$f":"IF($S9=\"true\",#REF!,\"\")","v":""},{"$f":"IF($S9=\"true\",SUM(P9:P12),\"\")","v":""}]
[null,null,"Name",null,false,null,0,null,false,null,null,null,null,null,"Alternate",0,null,null,"False","","","","","","","","","","","","","","","",{"$f":"IF($S10=\"true\",#REF!,\"\")","v":""},""]
[null,null,"Name",null,false,null,0,null,false,null,null,null,null,null,"Alternate",0,null,null,"False","","","","","","","","","","","","","","","",{"$f":"IF($S11=\"true\",#REF!,\"\")","v":""},""]
["Contractor Scope/Trade Detail:",null,null,null,null,null,null,null,null,null,null,null,null,null,null,null,"AEC PM Approval:",null,"False","","","","","","","","","","","","","","","",{"$f":"IF($S12=\"true\",#REF!,\"\")","v":""},""]
[null,null,"Name",null,false,null,0,null,false,false,{"$f":"C13","v":"Name"},null,null,null,"Base Bid",0,{"$f":"IF(S13=$S$1,SUM(P13:P16),0)","v":0},null,"False","","","","","","","","","","","","","","","",{"$f":"IF($S13=\"true\",#REF!,\"\")","v":""},""]
[null,null,"Name",null,false,null,0,null,null,null,null,null,null,null,"Alternate",0,null,null,"False","","","","","","","","","","","","","","","",{"$f":"IF($S14=\"true\",#REF!,\"\")","v":""},""]
[null,null,"Name",null,false,null,0,null,null,null,null,null,null,null,"Alternate",0,null,null,"False","","","","","","","","","","","","","","","",{"$f":"IF($S15=\"true\",#REF!,\"\")","v":""},""]
[null,null,"Name",null,false,null,0,null,null,null,null,null,null,null,"Alternate",0,null,null,"False","","","","","","","","","","","","","","","",{"$f":"IF($S16=\"true\",#REF!,\"\")","v":""},""]
["Contractor Scope/Trade Detail:",null,null,null,null,null,null,null,null,null,null,null,null,null,null,null,"AEC PM Approval:",null,"False","","","","","","","","","","","","","","","",{"$f":"IF($S17=\"true\",#REF!,\"\")","v":""},""]
[null,null,"Name",null,false,null,0,null,false,false,{"$f":"C18","v":"Name"},null,null,null,"Base Bid",0,{"$f":"IF(S18=$S$1,SUM(P18:P21),0)","v":0},null,"False","","","","","","","","","","","","","","","",{"$f":"IF($S18=\"true\",#REF!,\"\")","v":""},""]
[null,null,"Name",null,false,null,0,null,null,false,null,null,null,null,"Alternate",0,null,null,"False","","","","","","","","","","","","","","","",{"$f":"IF($S19=\"true\",#REF!,\"\")","v":""},""]
[null,null,"Name",null,false,null,0,null,null,false,null,null,null,null,"Alternate",0,null,null,"False","","","","","","","","","","","","","","","",{"$f":"IF($S20=\"true\",#REF!,\"\")","v":""},""]
[null,null,"Name",null,false,null,0,null,null,false,null,null,null,null,"Alternate",0,null,null,"False","","","","","","","","","","","","","","","",{"$f":"IF($S21=\"true\",#REF!,\"\")","v":""},""]
["Contractor Scope/Trade Detail:",null,null,null,null,null,null,null,null,null,null,null,null,null,null,null,"AEC PM Approval:",null,"False","","","","","","","","","","","","","","","",{"$f":"IF($S22=\"true\",#REF!,\"\")","v":""},""]
[null,null,"Name",null,false,null,0,null,null,false,{"$f":"C23","v":"Name"},null,null,null,"Base Bid",0,{"$f":"IF(S23=$S$1,SUM(P23:P26),0)","v":0},null,"False","","","","","","","","","","","","","","","",{"$f":"IF($S23=\"true\",#REF!,\"\")","v":""},""]
[null,null,"Name",null,false,null,0,null,null,null,null,null,null,null,"Alternate",0,null,null,"False","","","","","","","","","","","","","","","",{"$f":"IF($S24=\"true\",#REF!,\"\")","v":""},""]
[null,null,"Name",null,false,null,0,null,null,null,null,null,null,null,"Alternate",0,null,null,"False","","","","","","","","","","","","","","","",{"$f":"IF($S25=\"true\",#REF!,\"\")","v":""},""]
[null,null,"Name",null,false,null,0,null,null,null,null,null,null,null,"Alternate",0,null,null,"False","","","","","","","","","","","","","","","",{"$f":"IF($S26=\"true\",#REF!,\"\")","v":""},""]
["Contractor Scope/Trade Detail:",null,null,null,null,null,null,null,null,null,null,null,null,null,null,null,"AEC PM Approval:",null,"False","","","","","","","","","","","","","","","",{"$f":"IF($S27=\"true\",#REF!,\"\")","v":""},""]
[null,null,"Name",null,null,null,0,null,null,null,{"$f":"C28","v":"Name"},null,null,null,"Base Bid",0,{"$f":"IF(S28=$S$1,SUM(P28:P31),0)","v":0},null,"False","","","","","","","","","","","","","","","",{"$f":"IF($S28=\"true\",#REF!,\"\")","v":""},""]
[null,null,"Name",null,false,null,0,null,null,null,null,null,null,null,"Alternate",0,null,null,"False","","","","","","","","","","","","","","","",{"$f":"IF($S29=\"true\",#REF!,\"\")","v":""},""]
[null,null,"Name",null,false,null,0,null,null,null,null,null,null,null,"Alternate",0,null,null,"False","","","","","","","","","","","","","","","",{"$f":"IF($S30=\"true\",#REF!,\"\")","v":""},""]
[null,null,"Name",null,false,null,0,null,null,null,null,null,null,null,"Alternate",0,null,null,"False","","","","","","","","","","","","","","","",{"$f":"IF($S31=\"true\",#REF!,\"\")","v":""},""]
["Contractor Scope/Trade Detail:",null,null,null,null,null,null,null,null,null,null,null,null,null,null,null,"AEC PM Approval:",null,"False","","","","","","","","","","","","","","","",{"$f":"IF($S32=\"true\",#REF!,\"\")","v":""},""]
[null,null,"Name",null,false,null,0,null,null,null,{"$f":"C33","v":"Name"},null,null,null,"Base Bid",0,{"$f":"IF(S33=$S$1,SUM(P33:P36),0)","v":0},null,"False","","","","","","","","","","","","","","","",{"$f":"IF($S33=\"true\",#REF!,\"\")","v":""},""]
[null,null,"Name",null,false,null,0,null,null,null,null,null,null,null,"Alternate",0,null,null,"False","","","","","","","","","","","","","","","",{"$f":"IF($S34=\"true\",#REF!,\"\")","v":""},""]
[null,null,"Name",null,false,null,0,null,null,null,null,null,null,null,"Alternate",0,null,null,"False","","","","","","","","","","","","","","","",{"$f":"IF($S35=\"true\",#REF!,\"\")","v":""},""]
[null,null,"Name",null,false,null,0,null,null,null,null,null,null,null,"Alternate",0,null,null,"False","","","","","","","","","","","","","","","",{"$f":"IF($S36=\"true\",#REF!,\"\")","v":""},""]
["Contractor Scope/Trade Detail:",null,null,null,null,null,null,null,null,null,null,null,null,null,null,null,"AEC PM Approval:",null,"False","","","","","","","","","","","","","","","",{"$f":"IF($S37=\"true\",#REF!,\"\")","v":""},""]
[null,null,"Name",null,false,null,0,null,null,null,{"$f":"C38","v":"Name"},null,null,null,"Base Bid",0,{"$f":"IF(S38=$S$1,SUM(P38:P41),0)","v":0},null,"False","","","","","","","","","","","","","","","",{"$f":"IF($S38=\"true\",#REF!,\"\")","v":""},""]
[null,null,"Name",null,false,null,0,null,null,null,null,null,null,null,"Alternate",0,null,null,"False","","","","","","","","","","","","","","","",{"$f":"IF($S39=\"true\",#REF!,\"\")","v":""},""]
[null,null,"Name",null,false,null,0,null,null,null,null,null,null,null,"Alternate",0,null,null,"False","","","","","","","","","","","","","","","",{"$f":"IF($S40=\"true\",#REF!,\"\")","v":""},""]
[null,null,"Name",null,false,null,0,null,null,null,null,null,null,null,"Alternate",0,null,null,"False","","","",{"$f":"IF($S41=\"true\",\"A\",\"\")","v":""},"","",{"$f":"IF($S41=\"true\",\"A\",\"\")","v":""},"","","","","","","","",{"$f":"IF($S41=\"true\",#REF!,\"\")","v":""},""]
["Contractor Scope/Trade Detail:",null,null,null,null,null,null,null,null,null,null,null,null,null,null,null,"AEC PM Approval:",null,"False","","","","","","","","","","","","","","","",{"$f":"IF($S42=\"true\",#REF!,\"\")","v":""},""]
[null,null,"Name",null,false,null,0,null,false,null,{"$f":"C43","v":"Name"},null,null,null,"Base Bid",0,{"$f":"IF(S43=$S$1,SUM(P43:P46),0)","v":0},null,"False","","","","","","","","","","","","","","","",{"$f":"IF($S43=\"true\",#REF!,\"\")","v":""},""]
[null,null,"Name",null,false,null,0,null,false,null,null,null,null,null,"Alternate",0,null,null,"False","","","","","","","","","","","","","","","",{"$f":"IF($S44=\"true\",#REF!,\"\")","v":""},""]
[null,null,"Name",null,false,null,0,null,false,null,null,null,null,null,"Alternate",0,null,null,"False","","","","","","","","","","","","","","","",{"$f":"IF($S45=\"true\",#REF!,\"\")","v":""},""]
[null,null,"Name",null,false,null,0,null,false,null,null,null,null,null,"Alternate",0,null,null,"False","","","","","","","","","","","","","","","",{"$f":"IF($S46=\"true\",#REF!,\"\")","v":""},""]
["Contractor Scope/Trade Detail:",null,null,null,null,null,null,null,null,null,null,null,null,null,null,null,"AEC PM Approval:",null,"False","","","","","","","","","","","","","","","",{"$f":"IF($S47=\"true\",#REF!,\"\")","v":""},""]
[null,null,"Name",null,false,null,0,null,null,null,{"$f":"C48","v":"Name"},null,null,null,"Base Bid",0,{"$f":"IF(S48=$S$1,SUM(P48:P51),0)","v":0},null,"False","","","","","","","","","","","","","","","",{"$f":"IF($S48=\"true\",#REF!,\"\")","v":""},""]
[null,null,"Name",null,false,null,0,null,null,null,null,null,null,null,"Alternate",0,null,null,"False","","","","","","","","","","","","","","","",{"$f":"IF($S49=\"true\",#REF!,\"\")","v":""},""]
[null,null,"Name",null,false,null,0,null,false,null,null,null,null,null,"Alternate",0,null,null,"False","","","","","","","","","","","","","","",{"$f":"IF($S50=\"true\",#REF!,\"\")","v":""},{"$f":"IF($S50=\"true\",#REF!,\"\")","v":""},""]
[null,null,"Name",null,false,null,0,null,false,null,null,null,null,null,"Alternate",0,null,null,"False","","","","","","","","","","","","","",{"$f":"IF($S51=\"true\",#REF!,\"\")","v":""},{"$f":"IF($S51=\"true\",#REF!,\"\")","v":""},{"$f":"IF($S51=\"true\",#REF!,\"\")","v":""},""]
["Contractor Scope/Trade Detail:",null,null,null,null,null,null,null,null,null,null,null,null,null,null,null,"AEC PM Approval:",null,"False","","","","","","","","","","","","",{"$f":"IF($S52=\"true\",#REF!,\"\")","v":""},{"$f":"IF($S52=\"true\",#REF!,\"\")","v":""},{"$f":"IF($S52=\"true\",#REF!,\"\")","v":""},{"$f":"IF($S52=\"true\",#REF!,\"\")","v":""},""]
[null,null,"Name",null,false,null,0,null,false,null,{"$f":"C53","v":"Name"},null,null,null,"Base Bid",0,{"$f":"IF(S53=$S$1,SUM(P53:P56),0)","v":0},null,"False","","","","","","","","","","",{"$f":"IF($S53=\"true\",M53,\"\")","v":""},{"$f":"IF($S53=\"true\",P53,\"\")","v":""},{"$f":"IF($S53=\"true\",P54,\"\")","v":""},{"$f":"IF($S53=\"true\",P55,\"\")","v":""},{"$f":"IF($S53=\"true\",P56,\"\")","v":""},{"$f":"IF($S53=\"true\",#REF!,\"\")","v":""},""]
[null,null,"Name",null,false,null,0,null,null,null,null,null,null,null,"Alternate",0,null,null,"False","","","","","","","","","","",{"$f":"IF($S54=\"true\",M54,\"\")","v":""},{"$f":"IF($S54=\"true\",P54,\"\")","v":""},{"$f":"IF($S54=\"true\",P55,\"\")","v":""},{"$f":"IF($S54=\"true\",P56,\"\")","v":""},{"$f":"IF($S54=\"true\",P57,\"\")","v":""},{"$f":"IF($S54=\"true\",#REF!,\"\")","v":""},""]
[null,null,"Name",null,false,null,0,null,false,null,null,null,null,null,"Alternate",0,null,null,"False","","","","","","","","","","",{"$f":"IF($S55=\"true\",M55,\"\")","v":""},{"$f":"IF($S55=\"true\",P55,\"\")","v":""},{"$f":"IF($S55=\"true\",P56,\"\")","v":""},{"$f":"IF($S55=\"true\",P57,\"\")","v":""},{"$f":"IF($S55=\"true\",#REF!,\"\")","v":""},{"$f":"IF($S55=\"true\",#REF!,\"\")","v":""},""]
[null,null,"Name",null,false,null,0,null,null,null,null,null,null,null,"Alternate",0,null,null,"False","","","","","","","","","","",{"$f":"IF($S56=\"true\",M56,\"\")","v":""},{"$f":"IF($S56=\"true\",P56,\"\")","v":""},{"$f":"IF($S56=\"true\",P57,\"\")","v":""},{"$f":"IF($S56=\"true\",#REF!,\"\")","v":""},{"$f":"IF($S56=\"true\",#REF!,\"\")","v":""},{"$f":"IF($S56=\"true\",#REF!,\"\")","v":""},""]
["Contractor Scope/Trade Detail:",null,null,null,null,null,null,null,null,null,null,null,null,null,null,null,"AEC PM Approval:",null,"False","","","","","","","","","","",null,null,null,null,null,null,""]
[null,null,"Name",null,false,null,0,null,null,null,{"$f":"C58","v":"Name"},null,null,null,"Base Bid",0,{"$f":"IF(S58=$S$1,SUM(P58:P61),0)","v":0},null,"False","","","","","","","","","","",{"$f":"IF($S58=\"true\",M58,\"\")","v":""},{"$f":"IF($S58=\"true\",P58,\"\")","v":""},{"$f":"IF($S58=\"true\",P59,\"\")","v":""},{"$f":"IF($S58=\"true\",P60,\"\")","v":""},{"$f":"IF($S58=\"true\",P61,\"\")","v":""},{"$f":"IF($S58=\"true\",#REF!,\"\")","v":""},""]
[null,null,"Name",null,false,null,0,null,null,null,null,null,null,null,"Alternate",0,null,null,"False","","","","","","","","","","",{"$f":"IF($S59=\"true\",M59,\"\")","v":""},{"$f":"IF($S59=\"true\",P59,\"\")","v":""},{"$f":"IF($S59=\"true\",P60,\"\")","v":""},{"$f":"IF($S59=\"true\",P61,\"\")","v":""},{"$f":"IF($S59=\"true\",P62,\"\")","v":""},{"$f":"IF($S59=\"true\",#REF!,\"\")","v":""},""]
[null,null,"Name",null,false,null,0,null,false,null,null,null,null,null,"Alternate",0,null,null,"False","","","","","","","","","","",{"$f":"IF($S60=\"true\",M60,\"\")","v":""},{"$f":"IF($S60=\"true\",P60,\"\")","v":""},{"$f":"IF($S60=\"true\",P61,\"\")","v":""},{"$f":"IF($S60=\"true\",P62,\"\")","v":""},{"$f":"IF($S60=\"true\",#REF!,\"\")","v":""},{"$f":"IF($S60=\"true\",#REF!,\"\")","v":""},""]
[null,null,"Name",null,false,null,0,null,null,null,null,null,null,null,"Alternate",0,null,null,"False","","","","","","","","","","",{"$f":"IF($S61=\"true\",M61,\"\")","v":""},{"$f":"IF($S61=\"true\",P61,\"\")","v":""},{"$f":"IF($S61=\"true\",P62,\"\")","v":""},{"$f":"IF($S61=\"true\",#REF!,\"\")","v":""},{"$f":"IF($S61=\"true\",#REF!,\"\")","v":""},{"$f":"IF($S61=\"true\",#REF!,\"\")","v":""},""]
["Contractor Scope/Trade Detail:",null,null,null,null,null,null,null,null,null,null,null,null,null,null,null,"AEC PM Approval:",null,"False","","","","","","","","","","",null,null,null,null,null,null,""]
[null,null,"Name",null,false,null,0,null,null,null,{"$f":"C63","v":"Name"},null,null,null,"Base Bid",0,{"$f":"IF(S63=$S$1,SUM(P63:P66),0)","v":0},null,"False","","","","","","","","","","",{"$f":"IF($S63=\"true\",M63,\"\")","v":""},{"$f":"IF($S63=\"true\",P63,\"\")","v":""},{"$f":"IF($S63=\"true\",P64,\"\")","v":""},{"$f":"IF($S63=\"true\",P65,\"\")","v":""},{"$f":"IF($S63=\"true\",P66,\"\")","v":""},{"$f":"IF($S63=\"true\",#REF!,\"\")","v":""},""]
[null,null,"Name",null,false,null,0,null,null,null,null,null,null,null,"Alternate",0,null,null,"False","","","","","","","","","","",{"$f":"IF($S64=\"true\",M64,\"\")","v":""},{"$f":"IF($S64=\"true\",P64,\"\")","v":""},{"$f":"IF($S64=\"true\",P65,\"\")","v":""},{"$f":"IF($S64=\"true\",P66,\"\")","v":""},{"$f":"IF($S64=\"true\",P67,\"\")","v":""},{"$f":"IF($S64=\"true\",#REF!,\"\")","v":""},""]
[null,null,"Name",null,false,null,0,null,false,false,null,null,null,null,"Alternate",0,null,null,"False","","","","","","","","","","",{"$f":"IF($S65=\"true\",M65,\"\")","v":""},{"$f":"IF($S65=\"true\",P65,\"\")","v":""},{"$f":"IF($S65=\"true\",P66,\"\")","v":""},{"$f":"IF($S65=\"true\",P67,\"\")","v":""},{"$f":"IF($S65=\"true\",#REF!,\"\")","v":""},{"$f":"IF($S65=\"true\",#REF!,\"\")","v":""},{"$f":"IF($S65=\"true\",SUM(P65:P103),\"\")","v":""}]
[null,null,"Name",null,false,null,0,null,null,null,null,null,null,null,"Alternate",0,null,null,"False","","","","","","","","","","",{"$f":"IF($S66=\"true\",M66,\"\")","v":""},{"$f":"IF($S66=\"true\",P66,\"\")","v":""},{"$f":"IF($S66=\"true\",P67,\"\")","v":""},{"$f":"IF($S66=\"true\",#REF!,\"\")","v":""},{"$f":"IF($S66=\"true\",#REF!,\"\")","v":""},{"$f":"IF($S66=\"true\",#REF!,\"\")","v":""},{"$f":"IF($S66=\"true\",SUM(P66:P104),\"\")","v":""}]
["Contractor Scope/Trade Detail:",null,null,null,null,null,null,null,null,null,null,null,null,null,null,null,"AEC PM Approval:",null,"False","","","","","","","","","","",null,null,null,null,null,null,{"$f":"IF($S67=\"true\",SUM(P67:P105),\"\")","v":""}]
[null,null,"Name",null,false,null,0,null,null,null,{"$f":"C68","v":"Name"},null,null,null,"Base Bid",0,{"$f":"IF(S68=$S$1,SUM(P68:P71),0)","v":0},null,"False","","","","","","","","","","",{"$f":"IF($S68=\"true\",M68,\"\")","v":""},{"$f":"IF($S68=\"true\",P68,\"\")","v":""},{"$f":"IF($S68=\"true\",P69,\"\")","v":""},{"$f":"IF($S68=\"true\",P70,\"\")","v":""},{"$f":"IF($S68=\"true\",P71,\"\")","v":""},{"$f":"IF($S68=\"true\",#REF!,\"\")","v":""},{"$f":"IF($S68=\"true\",SUM(P68:P71),\"\")","v":""}]
[null,null,"Name",null,false,null,0,null,null,null,null,null,null,null,"Alternate",0,null,null,"False","","","","","","","","","","",{"$f":"IF($S69=\"true\",M69,\"\")","v":""},{"$f":"IF($S69=\"true\",P69,\"\")","v":""},{"$f":"IF($S69=\"true\",P70,\"\")","v":""},{"$f":"IF($S69=\"true\",P71,\"\")","v":""},{"$f":"IF($S69=\"true\",P72,\"\")","v":""},{"$f":"IF($S69=\"true\",#REF!,\"\")","v":""},{"$f":"IF($S69=\"true\",SUM(P69:P72),\"\")","v":""}]
[null,null,"Name",null,false,null,0,null,false,false,null,null,null,null,"Alternate",0,null,null,"False","","","","","","","","","","",{"$f":"IF($S70=\"true\",M70,\"\")","v":""},{"$f":"IF($S70=\"true\",P70,\"\")","v":""},{"$f":"IF($S70=\"true\",P71,\"\")","v":""},{"$f":"IF($S70=\"true\",P72,\"\")","v":""},{"$f":"IF($S70=\"true\",#REF!,\"\")","v":""},{"$f":"IF($S70=\"true\",#REF!,\"\")","v":""},{"$f":"IF($S70=\"true\",SUM(P70:P108),\"\")","v":""}]
[null,null,"Name",null,false,null,0,null,null,null,null,null,null,null,"Alternate",0,null,null,"False","","","","","","","","","","",{"$f":"IF($S71=\"true\",M71,\"\")","v":""},{"$f":"IF($S71=\"true\",P71,\"\")","v":""},{"$f":"IF($S71=\"true\",P72,\"\")","v":""},{"$f":"IF($S71=\"true\",#REF!,\"\")","v":""},{"$f":"IF($S71=\"true\",#REF!,\"\")","v":""},{"$f":"IF($S71=\"true\",#REF!,\"\")","v":""},{"$f":"IF($S71=\"true\",SUM(P71:P109),\"\")","v":""}]
["Contractor Scope/Trade Detail:",null,null,null,null,null,null,null,null,null,null,null,null,null,null,null,"AEC PM Approval:",null,"False","","","","","","","","","","",null,null,null,null,null,null,{"$f":"IF($S72=\"true\",SUM(P72:P110),\"\")","v":""}]
[null,null,"Name",null,false,null,0,null,null,null,{"$f":"C73","v":"Name"},null,null,null,"Base Bid",0,{"$f":"IF(S73=$S$1,SUM(P73:P76),0)","v":0},null,"False","","","","","","","","","","",{"$f":"IF($S73=\"true\",M73,\"\")","v":""},{"$f":"IF($S73=\"true\",P73,\"\")","v":""},{"$f":"IF($S73=\"true\",P74,\"\")","v":""},{"$f":"IF($S73=\"true\",P75,\"\")","v":""},{"$f":"IF($S73=\"true\",P76,\"\")","v":""},{"$f":"IF($S73=\"true\",#REF!,\"\")","v":""},{"$f":"IF($S73=\"true\",SUM(P73:P76),\"\")","v":""}]
[null,null,"Name",null,false,null,0,null,null,null,null,null,null,null,"Alternate",0,null,null,"False","","","","","","","","","","",{"$f":"IF($S74=\"true\",M74,\"\")","v":""},{"$f":"IF($S74=\"true\",P74,\"\")","v":""},{"$f":"IF($S74=\"true\",P75,\"\")","v":""},{"$f":"IF($S74=\"true\",P76,\"\")","v":""},{"$f":"IF($S74=\"true\",P77,\"\")","v":""},{"$f":"IF($S74=\"true\",#REF!,\"\")","v":""},{"$f":"IF($S74=\"true\",SUM(P74:P77),\"\")","v":""}]
[null,null,"Name",null,false,null,0,null,false,false,null,null,null,null,"Alternate",0,null,null,"False","","","","","","","","","","",{"$f":"IF($S75=\"true\",M75,\"\")","v":""},{"$f":"IF($S75=\"true\",P75,\"\")","v":""},{"$f":"IF($S75=\"true\",P76,\"\")","v":""},{"$f":"IF($S75=\"true\",P77,\"\")","v":""},{"$f":"IF($S75=\"true\",#REF!,\"\")","v":""},{"$f":"IF($S75=\"true\",#REF!,\"\")","v":""},{"$f":"IF($S75=\"true\",SUM(P75:P108),\"\")","v":""}]
[null,null,"Name",null,false,null,0,null,null,null,null,null,null,null,"Alternate",0,null,null,"False","","","","","","","","","","",{"$f":"IF($S76=\"true\",M76,\"\")","v":""},{"$f":"IF($S76=\"true\",P76,\"\")","v":""},{"$f":"IF($S76=\"true\",P77,\"\")","v":""},{"$f":"IF($S76=\"true\",#REF!,\"\")","v":""},{"$f":"IF($S76=\"true\",#REF!,\"\")","v":""},{"$f":"IF($S76=\"true\",#REF!,\"\")","v":""},{"$f":"IF($S76=\"true\",SUM(P76:P109),\"\")","v":""}]
["Contractor Scope/Trade Detail:",null,null,null,null,null,null,null,null,null,null,null,null,null,null,null,"AEC PM Approval:",null,"False","","","","","","","","","","",null,null,null,null,null,null,{"$f":"IF($S77=\"true\",SUM(P77:P110),\"\")","v":""}]
[null,null,"Name",null,false,null,0,null,null,null,{"$f":"C78","v":"Name"},null,null,null,"Base Bid",0,{"$f":"IF(S78=$S$1,SUM(P78:P81),0)","v":0},null,"False","","","","","","","","","","",{"$f":"IF($S78=\"true\",M78,\"\")","v":""},{"$f":"IF($S78=\"true\",P78,\"\")","v":""},{"$f":"IF($S78=\"true\",P79,\"\")","v":""},{"$f":"IF($S78=\"true\",P80,\"\")","v":""},{"$f":"IF($S78=\"true\",P81,\"\")","v":""},{"$f":"IF($S78=\"true\",#REF!,\"\")","v":""},{"$f":"IF($S78=\"true\",SUM(P78:P81),\"\")","v":""}]
[null,null,"Name",null,false,null,0,null,null,null,null,null,null,null,"Alternate",0,null,null,"False","","","","","","","","","","",{"$f":"IF($S79=\"true\",M79,\"\")","v":""},{"$f":"IF($S79=\"true\",P79,\"\")","v":""},{"$f":"IF($S79=\"true\",P80,\"\")","v":""},{"$f":"IF($S79=\"true\",P81,\"\")","v":""},{"$f":"IF($S79=\"true\",P82,\"\")","v":""},{"$f":"IF($S79=\"true\",#REF!,\"\")","v":""},{"$f":"IF($S79=\"true\",SUM(P79:P82),\"\")","v":""}]
[null,null,"Name",null,false,null,0,null,false,false,null,null,null,null,"Alternate",0,null,null,"False","","","","","","","","","","",{"$f":"IF($S80=\"true\",M80,\"\")","v":""},{"$f":"IF($S80=\"true\",P80,\"\")","v":""},{"$f":"IF($S80=\"true\",P81,\"\")","v":""},{"$f":"IF($S80=\"true\",P82,\"\")","v":""},{"$f":"IF($S80=\"true\",#REF!,\"\")","v":""},{"$f":"IF($S80=\"true\",#REF!,\"\")","v":""},{"$f":"IF($S80=\"true\",SUM(P80:P108),\"\")","v":""}]
[null,null,"Name",null,false,null,0,null,null,null,null,null,null,null,"Alternate",0,null,null,"False","","","","","","","","","","",{"$f":"IF($S81=\"true\",M81,\"\")","v":""},{"$f":"IF($S81=\"true\",P81,\"\")","v":""},{"$f":"IF($S81=\"true\",P82,\"\")","v":""},{"$f":"IF($S81=\"true\",#REF!,\"\")","v":""},{"$f":"IF($S81=\"true\",#REF!,\"\")","v":""},{"$f":"IF($S81=\"true\",#REF!,\"\")","v":""},{"$f":"IF($S81=\"true\",SUM(P81:P109),\"\")","v":""}]
["Contractor Scope/Trade Detail:",null,null,null,null,null,null,null,null,null,null,null,null,null,null,null,"AEC PM Approval:",null,"False","","","","","","","","","","",null,null,null,null,null,null,{"$f":"IF($S82=\"true\",SUM(P82:P110),\"\")","v":""}]
[null,null,"Name",null,false,null,0,null,null,null,{"$f":"C83","v":"Name"},null,null,null,"Base Bid",0,{"$f":"IF(S83=$S$1,SUM(P83:P86),0)","v":0},null,"False","","","","","","","","","","",{"$f":"IF($S83=\"true\",M83,\"\")","v":""},{"$f":"IF($S83=\"true\",P83,\"\")","v":""},{"$f":"IF($S83=\"true\",P84,\"\")","v":""},{"$f":"IF($S83=\"true\",P85,\"\")","v":""},{"$f":"IF($S83=\"true\",P86,\"\")","v":""},{"$f":"IF($S83=\"true\",#REF!,\"\")","v":""},{"$f":"IF($S83=\"true\",SUM(P83:P86),\"\")","v":""}]
[null,null,"Name",null,false,null,0,null,null,null,null,null,null,null,"Alternate",0,null,null,"False","","","","","","","","","","",{"$f":"IF($S84=\"true\",M84,\"\")","v":""},{"$f":"IF($S84=\"true\",P84,\"\")","v":""},{"$f":"IF($S84=\"true\",P85,\"\")","v":""},{"$f":"IF($S84=\"true\",P86,\"\")","v":""},{"$f":"IF($S84=\"true\",P87,\"\")","v":""},{"$f":"IF($S84=\"true\",#REF!,\"\")","v":""},{"$f":"IF($S84=\"true\",SUM(P84:P87),\"\")","v":""}]
[null,null,"Name",null,false,null,0,null,false,false,null,null,null,null,"Alternate",0,null,null,"False","","","","","","","","","","",{"$f":"IF($S85=\"true\",M85,\"\")","v":""},{"$f":"IF($S85=\"true\",P85,\"\")","v":""},{"$f":"IF($S85=\"true\",P86,\"\")","v":""},{"$f":"IF($S85=\"true\",P87,\"\")","v":""},{"$f":"IF($S85=\"true\",#REF!,\"\")","v":""},{"$f":"IF($S85=\"true\",#REF!,\"\")","v":""},{"$f":"IF($S85=\"true\",SUM(P85:P108),\"\")","v":""}]
[null,null,"Name",null,false,null,0,null,null,null,null,null,null,null,"Alternate",0,null,null,"False","","","","","","","","","","",{"$f":"IF($S86=\"true\",M86,\"\")","v":""},{"$f":"IF($S86=\"true\",P86,\"\")","v":""},{"$f":"IF($S86=\"true\",P87,\"\")","v":""},{"$f":"IF($S86=\"true\",#REF!,\"\")","v":""},{"$f":"IF($S86=\"true\",#REF!,\"\")","v":""},{"$f":"IF($S86=\"true\",#REF!,\"\")","v":""},{"$f":"IF($S86=\"true\",SUM(P86:P109),\"\")","v":""}]
["Contractor Scope/Trade Detail:",null,null,null,null,null,null,null,null,null,null,null,null,null,null,null,"AEC PM Approval:",null,"False","","","","","","","","","","",null,null,null,null,null,null,{"$f":"IF($S87=\"true\",SUM(P87:P110),\"\")","v":""}]
[null,null,"Name",null,false,null,0,null,null,null,{"$f":"C88","v":"Name"},null,null,null,"Base Bid",0,{"$f":"IF(S88=$S$1,SUM(P88:P91),0)","v":0},null,"False","","","","","","","","","","",{"$f":"IF($S88=\"true\",M88,\"\")","v":""},{"$f":"IF($S88=\"true\",P88,\"\")","v":""},{"$f":"IF($S88=\"true\",P89,\"\")","v":""},{"$f":"IF($S88=\"true\",P90,\"\")","v":""},{"$f":"IF($S88=\"true\",P91,\"\")","v":""},{"$f":"IF($S88=\"true\",#REF!,\"\")","v":""},{"$f":"IF($S88=\"true\",SUM(P88:P91),\"\")","v":""}]
[null,null,"Name",null,false,null,0,null,null,null,null,null,null,null,"Alternate",0,null,null,"False","","","","","","","","","","",{"$f":"IF($S89=\"true\",M89,\"\")","v":""},{"$f":"IF($S89=\"true\",P89,\"\")","v":""},{"$f":"IF($S89=\"true\",P90,\"\")","v":""},{"$f":"IF($S89=\"true\",P91,\"\")","v":""},{"$f":"IF($S89=\"true\",P92,\"\")","v":""},{"$f":"IF($S89=\"true\",#REF!,\"\")","v":""},{"$f":"IF($S89=\"true\",SUM(P89:P92),\"\")","v":""}]
[null,null,"Name",null,false,null,0,null,false,false,null,null,null,null,"Alternate",0,null,null,"False","","","","","","","","","","",{"$f":"IF($S90=\"true\",M90,\"\")","v":""},{"$f":"IF($S90=\"true\",P90,\"\")","v":""},{"$f":"IF($S90=\"true\",P91,\"\")","v":""},{"$f":"IF($S90=\"true\",P92,\"\")","v":""},{"$f":"IF($S90=\"true\",#REF!,\"\")","v":""},{"$f":"IF($S90=\"true\",#REF!,\"\")","v":""},{"$f":"IF($S90=\"true\",SUM(P90:P108),\"\")","v":""}]
[null,null,"Name",null,false,null,0,null,null,null,null,null,null,null,"Alternate",0,null,null,"False","","","","","","","","","","",{"$f":"IF($S91=\"true\",M91,\"\")","v":""},{"$f":"IF($S91=\"true\",P91,\"\")","v":""},{"$f":"IF($S91=\"true\",P92,\"\")","v":""},{"$f":"IF($S91=\"true\",#REF!,\"\")","v":""},{"$f":"IF($S91=\"true\",#REF!,\"\")","v":""},{"$f":"IF($S91=\"true\",#REF!,\"\")","v":""},{"$f":"IF($S91=\"true\",SUM(P91:P109),\"\")","v":""}]
["Contractor Scope/Trade Detail:",null,null,null,null,null,null,null,null,null,null,null,null,null,null,null,"UM PM Approval:",null,"False","","","","","","","","","","",null,null,null,null,null,null,{"$f":"IF($S92=\"true\",SUM(P92:P110),\"\")","v":""}]
[null,null,"Name",null,false,null,0,null,null,null,{"$f":"C93","v":"Name"},null,null,null,"Base Bid",0,{"$f":"IF(S93=$S$1,SUM(P93:P96),0)","v":0},null,"False","","","","","","","","","","",{"$f":"IF($S93=\"true\",M93,\"\")","v":""},{"$f":"IF($S93=\"true\",P93,\"\")","v":""},{"$f":"IF($S93=\"true\",P94,\"\")","v":""},{"$f":"IF($S93=\"true\",P95,\"\")","v":""},{"$f":"IF($S93=\"true\",P96,\"\")","v":""},{"$f":"IF($S93=\"true\",#REF!,\"\")","v":""},{"$f":"IF($S93=\"true\",SUM(P93:P96),\"\")","v":""}]
[null,null,"Name",null,false,null,0,null,false,null,null,null,null,null,"Alternate",0,null,null,"False","","","","","","","","","","",{"$f":"IF($S94=\"true\",M94,\"\")","v":""},{"$f":"IF($S94=\"true\",P94,\"\")","v":""},{"$f":"IF($S94=\"true\",P95,\"\")","v":""},{"$f":"IF($S94=\"true\",P96,\"\")","v":""},{"$f":"IF($S94=\"true\",P97,\"\")","v":""},{"$f":"IF($S94=\"true\",#REF!,\"\")","v":""},{"$f":"IF($S94=\"true\",SUM(P94:P97),\"\")","v":""}]
[null,null,"Name",null,false,null,0,null,false,null,null,null,null,null,"Alternate",0,null,null,"False","","","","","","","","","","",{"$f":"IF($S95=\"true\",M95,\"\")","v":""},{"$f":"IF($S95=\"true\",P95,\"\")","v":""},{"$f":"IF($S95=\"true\",P96,\"\")","v":""},{"$f":"IF($S95=\"true\",P97,\"\")","v":""},{"$f":"IF($S95=\"true\",#REF!,\"\")","v":""},{"$f":"IF($S95=\"true\",#REF!,\"\")","v":""},{"$f":"IF($S95=\"true\",SUM(P95:P108),\"\")","v":""}]
[null,null,"Name",null,false,null,0,null,null,null,null,null,null,null,"Alternate",0,null,null,"False","","","","","","","","","","",{"$f":"IF($S96=\"true\",M96,\"\")","v":""},{"$f":"IF($S96=\"true\",P96,\"\")","v":""},{"$f":"IF($S96=\"true\",P97,\"\")","v":""},{"$f":"IF($S96=\"true\",#REF!,\"\")","v":""},{"$f":"IF($S96=\"true\",#REF!,\"\")","v":""},{"$f":"IF($S96=\"true\",#REF!,\"\")","v":""},{"$f":"IF($S96=\"true\",SUM(P96:P109),\"\")","v":""}]
["Contractor Scope/Trade Detail:",null,null,null,null,null,null,null,null,null,null,null,null,null,null,null,"AEC PM Approval:",null,"False","","","","","","","","","","",null,null,null,null,null,null,{"$f":"IF($S97=\"true\",SUM(P97:P110),\"\")","v":""}]
[null,null,"Name",null,false,null,0,null,null,null,{"$f":"C98","v":"Name"},null,null,null,"Base Bid",0,{"$f":"IF(S98=$S$1,SUM(P98:P101),0)","v":0},null,"False","","","","","","","","","","",{"$f":"IF($S98=\"true\",M98,\"\")","v":""},{"$f":"IF($S98=\"true\",P98,\"\")","v":""},{"$f":"IF($S98=\"true\",P99,\"\")","v":""},{"$f":"IF($S98=\"true\",P100,\"\")","v":""},{"$f":"IF($S98=\"true\",P101,\"\")","v":""},{"$f":"IF($S98=\"true\",#REF!,\"\")","v":""},{"$f":"IF($S98=\"true\",SUM(P98:P101),\"\")","v":""}]
[null,null,"Name",null,false,null,0,null,null,null,null,null,null,null,"Alternate",0,null,null,"False","","","","","","","","","","",{"$f":"IF($S99=\"true\",M99,\"\")","v":""},{"$f":"IF($S99=\"true\",P99,\"\")","v":""},{"$f":"IF($S99=\"true\",P100,\"\")","v":""},{"$f":"IF($S99=\"true\",P101,\"\")","v":""},{"$f":"IF($S99=\"true\",P102,\"\")","v":""},{"$f":"IF($S99=\"true\",#REF!,\"\")","v":""},{"$f":"IF($S99=\"true\",SUM(P99:P102),\"\")","v":""}]
[null,null,"Name",null,false,null,0,null,null,null,null,null,null,null,"Alternate",0,null,null,"False","","","","","","","","","","",{"$f":"IF($S100=\"true\",M100,\"\")","v":""},{"$f":"IF($S100=\"true\",P100,\"\")","v":""},{"$f":"IF($S100=\"true\",P101,\"\")","v":""},{"$f":"IF($S100=\"true\",P102,\"\")","v":""},{"$f":"IF($S100=\"true\",#REF!,\"\")","v":""},{"$f":"IF($S100=\"true\",#REF!,\"\")","v":""},{"$f":"IF($S100=\"true\",SUM(P100:P108),\"\")","v":""}]
[null,null,"Name",null,false,null,0,null,null,null,null,null,null,null,"Alternate",0,null,null,"False","","","","","","","","","","",{"$f":"IF($S101=\"true\",M101,\"\")","v":""},{"$f":"IF($S101=\"true\",P101,\"\")","v":""},{"$f":"IF($S101=\"true\",P102,\"\")","v":""},{"$f":"IF($S101=\"true\",#REF!,\"\")","v":""},{"$f":"IF($S101=\"true\",#REF!,\"\")","v":""},{"$f":"IF($S101=\"true\",#REF!,\"\")","v":""},{"$f":"IF($S101=\"true\",SUM(P101:P109),\"\")","v":""}]
["Contractor Scope/Trade Detail:",null,null,null,null,null,null,null,null,null,null,null,null,null,null,null,"AEC PM Approval:",null,"False","","","","","","","","","","",null,null,null,null,null,null,{"$f":"IF($S102=\"true\",SUM(P102:P110),\"\")","v":""}]
[null,null,"Name",null,false,null,0,null,false,false,{"$f":"C103","v":"Name"},null,null,null,"Base Bid",0,{"$f":"IF(S103=$S$1,SUM(P103:P106),0)","v":0},null,"False","","","","","","","","","","",{"$f":"IF($S103=\"true\",M103,\"\")","v":""},{"$f":"IF($S103=\"true\",P103,\"\")","v":""},{"$f":"IF($S103=\"true\",P104,\"\")","v":""},{"$f":"IF($S103=\"true\",P105,\"\")","v":""},{"$f":"IF($S103=\"true\",P106,\"\")","v":""},{"$f":"IF($S103=\"true\",#REF!,\"\")","v":""},{"$f":"IF($S103=\"true\",SUM(P103:P106),\"\")","v":""}]
[null,null,"Name",null,false,null,0,null,false,null,null,null,null,null,"Alternate",0,null,null,"False","","","","","","","","","","",{"$f":"IF($S104=\"true\",M104,\"\")","v":""},{"$f":"IF($S104=\"true\",P104,\"\")","v":""},{"$f":"IF($S104=\"true\",P105,\"\")","v":""},{"$f":"IF($S104=\"true\",P106,\"\")","v":""},{"$f":"IF($S104=\"true\",P107,\"\")","v":""},{"$f":"IF($S104=\"true\",#REF!,\"\")","v":""},""]
[null,null,"Name",null,false,null,0,null,false,false,null,null,null,null,"Alternate",0,null,null,"False","","","","","","","","","","",{"$f":"IF($S105=\"true\",M105,\"\")","v":""},{"$f":"IF($S105=\"true\",P105,\"\")","v":""},{"$f":"IF($S105=\"true\",P106,\"\")","v":""},{"$f":"IF($S105=\"true\",P107,\"\")","v":""},{"$f":"IF($S105=\"true\",#REF!,\"\")","v":""},{"$f":"IF($S105=\"true\",#REF!,\"\")","v":""},{"$f":"IF($S105=\"true\",SUM(P105:P108),\"\")","v":""}]
[null,null,"Name",null,false,null,0,null,false,null,null,null,null,null,"Alternate",0,null,null,"False","","","","","","","","","","",{"$f":"IF($S106=\"true\",M106,\"\")","v":""},{"$f":"IF($S106=\"true\",P106,\"\")","v":""},{"$f":"IF($S106=\"true\",P107,\"\")","v":""},{"$f":"IF($S106=\"true\",#REF!,\"\")","v":""},{"$f":"IF($S106=\"true\",#REF!,\"\")","v":""},{"$f":"IF($S106=\"true\",#REF!,\"\")","v":""},{"$f":"IF($S106=\"true\",SUM(P106:P109),\"\")","v":""}]
["Contractor Scope/Trade Detail:",null,null,null,null,null,null,null,null,null,null,null,null,null,null,null,"AEC PM Approval:"]
[null,null,"Name",null,false,null,0,null,null,null,{"$f":"C108","v":"Name"},null,null,null,"Base Bid",0,{"$f":"SUM(P108:P111)","v":0},null,{"$f":"IF(E108,\"True\",\"False\")","v":"False"},{"$f":"IF($S108=\"true\",A108,\"\")","v":""},{"$f":"IF($S108=\"true\",C108,\"\")","v":""},{"$f":"IF($S108=\"true\",E108,\"\")","v":""},"",{"$f":"IF($S108=\"true\",F108,\"\")","v":""},"",{"$f":"IF($S108=\"true\",I108,\"\")","v":""},"",{"$f":"IF($S108=\"true\",J108,\"\")","v":""},"",{"$f":"IF($S108=\"true\",M108,\"\")","v":""},{"$f":"IF($S108=\"true\",P108,\"\")","v":""},{"$f":"IF($S108=\"true\",P109,\"\")","v":""},{"$f":"IF($S108=\"true\",P110,\"\")","v":""},{"$f":"IF($S108=\"true\",P111,\"\")","v":""},{"$f":"IF($S108=\"true\",#REF!,\"\")","v":""},{"$f":"IF($S108=\"true\",Q108,\"\")","v":""}]
[null,null,"Name",null,false,null,0,null,null,null,null,null,null,null,"Alternate",0,null,null,{"$f":"IF(E109,\"True\",\"False\")","v":"False"},{"$f":"IF($S109=\"true\",A109,\"\")","v":""},{"$f":"IF($S109=\"true\",C109,\"\")","v":""},"","","","","","","","",{"$f":"IF($S109=\"true\",M109,\"\")","v":""},{"$f":"IF($S109=\"true\",P109,\"\")","v":""},{"$f":"IF($S109=\"true\",P110,\"\")","v":""},{"$f":"IF($S109=\"true\",P111,\"\")","v":""},{"$f":"IF($S109=\"true\",P112,\"\")","v":""},{"$f":"IF($S109=\"true\",#REF!,\"\")","v":""},{"$f":"IF($S109=\"true\",Q109,\"\")","v":""}]
[null,null,"Name",null,false,null,0,null,null,null,null,null,null,null,"Alternate",0,null,null,{"$f":"IF(E110,\"True\",\"False\")","v":"False"},{"$f":"IF($S110=\"true\",A110,\"\")","v":""},{"$f":"IF($S110=\"true\",C110,\"\")","v":""},"","","","","","","","",{"$f":"IF($S110=\"true\",M110,\"\")","v":""},{"$f":"IF($S110=\"true\",P110,\"\")","v":""},{"$f":"IF($S110=\"true\",P111,\"\")","v":""},{"$f":"IF($S110=\"true\",P112,\"\")","v":""},{"$f":"IF($S110=\"true\",#REF!,\"\")","v":""},{"$f":"IF($S110=\"true\",#REF!,\"\")","v":""},{"$f":"IF($S110=\"true\",Q110,\"\")","v":""}]
[null,null,"Name",null,false,null,0,null,null,null,null,null,null,null,"Alternate",0,null,null,{"$f":"IF(E111,\"True\",\"False\")","v":"False"},{"$f":"IF($S111=\"true\",A111,\"\")","v":""},{"$f":"IF($S111=\"true\",C111,\"\")","v":""},"","","","","","","","",{"$f":"IF($S111=\"true\",M111,\"\")","v":""},{"$f":"IF($S111=\"true\",P111,\"\")","v":""},{"$f":"IF($S111=\"true\",P112,\"\")","v":""},{"$f":"IF($S111=\"true\",#REF!,\"\")","v":""},{"$f":"IF($S111=\"true\",#REF!,\"\")","v":""},{"$f":"IF($S111=\"true\",#REF!,\"\")","v":""},{"$f":"IF($S111=\"true\",Q111,\"\")","v":""}]
["Contractor Scope/Trade Detail:",null,null,null,null,null,null,null,null,null,null,null,null,null,null,null,"PM Approval:"]
[]
[null,null,null,null,null,null,null,null,null,null,null,"Trade Contractor Subtotal:",null,null,null,"Lump Sum",{"$f":"SUBTOTAL(9,Q8:R113)","v":0}]
[]
[]
[]
[]
[]
[]
[]
[]
[]
[]
[]
[]
[]
[]
[]
[]
["Full Time Laborer When Contracturally Required"]
["Scope/Trade\n(Includes CSI #'s for clarity)",null,"Proposed Trade Contractor/Self Perform",null,"Self Perform","Decline Bid or No Response","Proposed Amounts \n(low to high)",null,"No Estimates at GMP",null,"Selected Firm",null,"EMR",null,"Intended Awardee Proposal Detail  & (accepted alternates only)",null,"Total"]
[null,null,"Name",null,"N/A",null,0,null,false,false,{"$f":"C133","v":"Name"},null,null,null,"Base Bid",0,{"$f":"SUM(P133:P136)","v":0}]
[null,null,"Name",null,"N/A",null,0,null,null,false,null,null,null,null,"Alternate",0]
[null,null,"Name",null,"N/A",null,0,null,false,false,null,null,null,null,"Alternate",0]
[null,null,"Name",null,"N/A",null,0,null,false,null,null,null,null,null,"Alternate",0]
["Contractor Scope/Trade Detail:",null,null,null,null,null,null,null,null,null,null,null,null,null,null,null,"AEC PM Approval:"]
[null,null,"Name",null,"N/A",null,0,null,false,false,{"$f":"C138","v":"Name"},null,null,null,"Base Bid",0,{"$f":"SUM(P138:P141)","v":0}]
[null,null,"Name",null,"N/A",null,0,null,false,false,null,null,null,null,"Alternate",0]
[null,null,"Name",null,"N/A",null,0,null,false,null,null,null,null,null,"Alternate",0]
[null,null,"Name",null,"N/A",null,0,null,false,false,null,null,null,null,"Alternate",0]
["Contractor Scope/Trade Detail:",null,null,null,null,null,null,null,null,null,null,null,null,null,null,null,"PM Approval:"]
[]
[null,null,null,null,null,null,null,null,null,null,null,"Full Time Laborer Subtotal:",null,null,null,"Lump Sum",{"$f":"SUBTOTAL(9,Q133:R142)","v":0}]
[]
["Self- Perform",null,null,null,null,null,null,null,null,null,null,"(Self Performed is not included in Trade Contractor Subtotal)"]
["Scope/Trade",null,"Trade Contractor",null,"Proposed Amount",null,null,null,null,null,null,null,null,null,null,"Proposed Amount","Total"]
[{"$f":"IFERROR(T148:T148,\"\")","v":""},null,{"$f":"IFERROR(U148,\"\")","v":""},null,{"$f":"IFERROR(Y148,\"$\")","v":"$"},null,null,null,null,null,null,null,null,null,null,{"$f":"IFERROR(AJ148,\"$\")","v":"$"},{"$f":"SUBTOTAL(9,P148:P159)","v":0},null,null,{"$f":"INDEX($T$8:$AM$112,SMALL(IF(COUNTIF($T$5,$T$8:$AM$112),MATCH(ROW($T$8:$AM$112),ROW($T$8:$AM$112)),\"\"),ROWS(V$152:$V152)),COLUMNS(V$152:$V152))","v":{"$error":"#NUM!"}},{"$f":"INDEX($T$8:$AM$112,SMALL(IF(COUNTIF($T$5,$T$8:$AM$112),MATCH(ROW($T$8:$AM$112),ROW($T$8:$AM$112)),\"\"),ROWS($V$152:W152)),COLUMNS($V$152:W152))","v":{"$error":"#NUM!"}},{"$f":"INDEX($T$8:$AM$112,SMALL(IF(COUNTIF($T$5,$T$8:$AM$112),MATCH(ROW($T$8:$AM$112),ROW($T$8:$AM$112)),\"\"),ROWS($V$152:X152)),COLUMNS($V$152:X152))","v":{"$error":"#NUM!"}},{"$f":"INDEX($T$8:$AM$112,SMALL(IF(COUNTIF($T$5,$T$8:$AM$112),MATCH(ROW($T$8:$AM$112),ROW($T$8:$AM$112)),\"\"),ROWS($V$152:Y152)),COLUMNS($V$152:Y152))","v":{"$error":"#NUM!"}},{"$f":"INDEX($T$8:$AM$112,SMALL(IF(COUNTIF($T$5,$T$8:$AM$112),MATCH(ROW($T$8:$AM$112),ROW($T$8:$AM$112)),\"\"),ROWS($V$152:Z152)),COLUMNS($V$152:Z152))","v":{"$error":"#NUM!"}},{"$f":"INDEX($T$8:$AM$112,SMALL(IF(COUNTIF($T$5,$T$8:$AM$112),MATCH(ROW($T$8:$AM$112),ROW($T$8:$AM$112)),\"\"),ROWS($V$152:AA152)),COLUMNS($V$152:AA152))","v":{"$error":"#NUM!"}},{"$f":"INDEX($T$8:$AM$112,SMALL(IF(COUNTIF($T$5,$T$8:$AM$112),MATCH(ROW($T$8:$AM$112),ROW($T$8:$AM$112)),\"\"),ROWS($V$152:AB152)),COLUMNS($V$152:AB152))","v":{"$error":"#NUM!"}},{"$f":"INDEX($T$8:$AM$112,SMALL(IF(COUNTIF($T$5,$T$8:$AM$112),MATCH(ROW($T$8:$AM$112),ROW($T$8:$AM$112)),\"\"),ROWS($V$152:AC152)),COLUMNS($V$152:AC152))","v":{"$error":"#NUM!"}},{"$f":"INDEX($T$8:$AM$112,SMALL(IF(COUNTIF($T$5,$T$8:$AM$112),MATCH(ROW($T$8:$AM$112),ROW($T$8:$AM$112)),\"\"),ROWS($V$152:AD152)),COLUMNS($V$152:AD152))","v":{"$error":"#NUM!"}},{"$f":"INDEX($T$8:$AM$112,SMALL(IF(COUNTIF($T$5,$T$8:$AM$112),MATCH(ROW($T$8:$AM$112),ROW($T$8:$AM$112)),\"\"),ROWS($V$152:AE152)),COLUMNS($V$152:AE152))","v":{"$error":"#NUM!"}},{"$f":"INDEX($T$8:$AM$112,SMALL(IF(COUNTIF($T$5,$T$8:$AM$112),MATCH(ROW($T$8:$AM$112),ROW($T$8:$AM$112)),\"\"),ROWS($V$152:AF152)),COLUMNS($V$152:AF152))","v":{"$error":"#NUM!"}},{"$f":"INDEX($T$8:$AM$112,SMALL(IF(COUNTIF($T$5,$T$8:$AM$112),MATCH(ROW($T$8:$AM$112),ROW($T$8:$AM$112)),\"\"),ROWS($V$152:AG152)),COLUMNS($V$152:AG152))","v":{"$error":"#NUM!"}},{"$f":"INDEX($T$8:$AM$112,SMALL(IF(COUNTIF($T$5,$T$8:$AM$112),MATCH(ROW($T$8:$AM$112),ROW($T$8:$AM$112)),\"\"),ROWS($V$152:AH152)),COLUMNS($V$152:AH152))","v":{"$error":"#NUM!"}},{"$f":"INDEX($T$8:$AM$112,SMALL(IF(COUNTIF($T$5,$T$8:$AM$112),MATCH(ROW($T$8:$AM$112),ROW($T$8:$AM$112)),\"\"),ROWS($V$152:AI152)),COLUMNS($V$152:AI152))","v":{"$error":"#NUM!"}},{"$f":"INDEX($T$8:$AM$112,SMALL(IF(COUNTIF($T$5,$T$8:$AM$112),MATCH(ROW($T$8:$AM$112),ROW($T$8:$AM$112)),\"\"),ROWS($V$152:AJ152)),COLUMNS($V$152:AJ152))","v":{"$error":"#NUM!"}},{"$f":"INDEX($T$8:$AM$112,SMALL(IF(COUNTIF($T$5,$T$8:$AM$112),MATCH(ROW($T$8:$AM$112),ROW($T$8:$AM$112)),\"\"),ROWS($V$152:AK152)),COLUMNS($V$152:AK152))","v":{"$error":"#NUM!"}},{"$f":"INDEX($T$8:$AM$112,SMALL(IF(COUNTIF($T$5,$T$8:$AM$112),MATCH(ROW($T$8:$AM$112),ROW($T$8:$AM$112)),\"\"),ROWS($V$152:AL152)),COLUMNS($V$152:AL152))","v":{"$error":"#NUM!"}},{"$f":"INDEX($T$8:$AM$112,SMALL(IF(COUNTIF($T$5,$T$8:$AM$112),MATCH(ROW($T$8:$AM$112),ROW($T$8:$AM$112)),\"\"),ROWS($V$152:AM152)),COLUMNS($V$152:AM152))","v":{"$error":"#NUM!"}},{"$f":"INDEX($T$8:$AM$112,SMALL(IF(COUNTIF($T$5,$T$8:$AM$112),MATCH(ROW($T$8:$AM$112),ROW($T$8:$AM$112)),\"\"),ROWS($V$152:AN152)),COLUMNS($V$152:AN152))","v":{"$error":"#NUM!"}},{"$f":"INDEX($T$8:$AM$112,SMALL(IF(COUNTIF($T$5,$T$8:$AM$112),MATCH(ROW($T$8:$AM$112),ROW($T$8:$AM$112)),\"\"),ROWS($V$152:AO152)),COLUMNS($V$152:AO152))","v":{"$error":"#NUM!"}},null,null,null,null,null,null,null,null,null,null,"*"]
["",null,"",null,"$",null,null,null,null,null,null,null,null,null,null,{"$f":"IFERROR(AJ149,\"$\")","v":"$"},null,null,null,{"$f":"INDEX($T$8:$AM$112,SMALL(IF(COUNTIF($T$5,$T$8:$AM$112),MATCH(ROW($T$8:$AM$112),ROW($T$8:$AM$112)),\"\"),ROWS(V$152:$V153)),COLUMNS(V$152:$V153))","v":{"$error":"#NUM!"}},{"$f":"INDEX($T$8:$AM$112,SMALL(IF(COUNTIF($T$5,$T$8:$AM$112),MATCH(ROW($T$8:$AM$112),ROW($T$8:$AM$112)),\"\"),ROWS($V$152:W153)),COLUMNS($V$152:W153))","v":{"$error":"#NUM!"}},{"$f":"INDEX($T$8:$AM$112,SMALL(IF(COUNTIF($T$5,$T$8:$AM$112),MATCH(ROW($T$8:$AM$112),ROW($T$8:$AM$112)),\"\"),ROWS($V$152:X153)),COLUMNS($V$152:X153))","v":{"$error":"#NUM!"}},{"$f":"INDEX($T$8:$AM$112,SMALL(IF(COUNTIF($T$5,$T$8:$AM$112),MATCH(ROW($T$8:$AM$112),ROW($T$8:$AM$112)),\"\"),ROWS($V$152:Y153)),COLUMNS($V$152:Y153))","v":{"$error":"#NUM!"}},{"$f":"INDEX($T$8:$AM$112,SMALL(IF(COUNTIF($T$5,$T$8:$AM$112),MATCH(ROW($T$8:$AM$112),ROW($T$8:$AM$112)),\"\"),ROWS($V$152:Z153)),COLUMNS($V$152:Z153))","v":{"$error":"#NUM!"}},{"$f":"INDEX($T$8:$AM$112,SMALL(IF(COUNTIF($T$5,$T$8:$AM$112),MATCH(ROW($T$8:$AM$112),ROW($T$8:$AM$112)),\"\"),ROWS($V$152:AA153)),COLUMNS($V$152:AA153))","v":{"$error":"#NUM!"}},{"$f":"INDEX($T$8:$AM$112,SMALL(IF(COUNTIF($T$5,$T$8:$AM$112),MATCH(ROW($T$8:$AM$112),ROW($T$8:$AM$112)),\"\"),ROWS($V$152:AB153)),COLUMNS($V$152:AB153))","v":{"$error":"#NUM!"}},{"$f":"INDEX($T$8:$AM$112,SMALL(IF(COUNTIF($T$5,$T$8:$AM$112),MATCH(ROW($T$8:$AM$112),ROW($T$8:$AM$112)),\"\"),ROWS($V$152:AC153)),COLUMNS($V$152:AC153))","v":{"$error":"#NUM!"}},{"$f":"INDEX($T$8:$AM$112,SMALL(IF(COUNTIF($T$5,$T$8:$AM$112),MATCH(ROW($T$8:$AM$112),ROW($T$8:$AM$112)),\"\"),ROWS($V$152:AD153)),COLUMNS($V$152:AD153))","v":{"$error":"#NUM!"}},{"$f":"INDEX($T$8:$AM$112,SMALL(IF(COUNTIF($T$5,$T$8:$AM$112),MATCH(ROW($T$8:$AM$112),ROW($T$8:$AM$112)),\"\"),ROWS($V$152:AE153)),COLUMNS($V$152:AE153))","v":{"$error":"#NUM!"}},{"$f":"INDEX($T$8:$AM$112,SMALL(IF(COUNTIF($T$5,$T$8:$AM$112),MATCH(ROW($T$8:$AM$112),ROW($T$8:$AM$112)),\"\"),ROWS($V$152:AF153)),COLUMNS($V$152:AF153))","v":{"$error":"#NUM!"}},{"$f":"INDEX($T$8:$AM$112,SMALL(IF(COUNTIF($T$5,$T$8:$AM$112),MATCH(ROW($T$8:$AM$112),ROW($T$8:$AM$112)),\"\"),ROWS($V$152:AG153)),COLUMNS($V$152:AG153))","v":{"$error":"#NUM!"}},{"$f":"INDEX($T$8:$AM$112,SMALL(IF(COUNTIF($T$5,$T$8:$AM$112),MATCH(ROW($T$8:$AM$112),ROW($T$8:$AM$112)),\"\"),ROWS($V$152:AH153)),COLUMNS($V$152:AH153))","v":{"$error":"#NUM!"}},{"$f":"INDEX($T$8:$AM$112,SMALL(IF(COUNTIF($T$5,$T$8:$AM$112),MATCH(ROW($T$8:$AM$112),ROW($T$8:$AM$112)),\"\"),ROWS($V$152:AI153)),COLUMNS($V$152:AI153))","v":{"$error":"#NUM!"}},{"$f":"INDEX($T$8:$AM$112,SMALL(IF(COUNTIF($T$5,$T$8:$AM$112),MATCH(ROW($T$8:$AM$112),ROW($T$8:$AM$112)),\"\"),ROWS($V$152:AJ153)),COLUMNS($V$152:AJ153))","v":{"$error":"#NUM!"}},{"$f":"INDEX($T$8:$AM$112,SMALL(IF(COUNTIF($T$5,$T$8:$AM$112),MATCH(ROW($T$8:$AM$112),ROW($T$8:$AM$112)),\"\"),ROWS($V$152:AK153)),COLUMNS($V$152:AK153))","v":{"$error":"#NUM!"}},{"$f":"INDEX($T$8:$AM$112,SMALL(IF(COUNTIF($T$5,$T$8:$AM$112),MATCH(ROW($T$8:$AM$112),ROW($T$8:$AM$112)),\"\"),ROWS($V$152:AL153)),COLUMNS($V$152:AL153))","v":{"$error":"#NUM!"}},{"$f":"INDEX($T$8:$AM$112,SMALL(IF(COUNTIF($T$5,$T$8:$AM$112),MATCH(ROW($T$8:$AM$112),ROW($T$8:$AM$112)),\"\"),ROWS($V$152:AM153)),COLUMNS($V$152:AM153))","v":{"$error":"#NUM!"}},{"$f":"INDEX($T$8:$AM$112,SMALL(IF(COUNTIF($T$5,$T$8:$AM$112),MATCH(ROW($T$8:$AM$112),ROW($T$8:$AM$112)),\"\"),ROWS($V$152:AN153)),COLUMNS($V$152:AN153))","v":{"$error":"#NUM!"}},{"$f":"INDEX($T$8:$AM$112,SMALL(IF(COUNTIF($T$5,$T$8:$AM$112),MATCH(ROW($T$8:$AM$112),ROW($T$8:$AM$112)),\"\"),ROWS($V$152:AO153)),COLUMNS($V$152:AO153))","v":{"$error":"#NUM!"}}]
["",null,"",null,"$",null,null,null,null,null,null,null,null,null,null,{"$f":"IFERROR(AJ150,\"$\")","v":"$"},null,null,null,{"$f":"INDEX($T$8:$AM$112,SMALL(IF(COUNTIF($T$5,$T$8:$AM$112),MATCH(ROW($T$8:$AM$112),ROW($T$8:$AM$112)),\"\"),ROWS(V$152:$V154)),COLUMNS(V$152:$V154))","v":{"$error":"#NUM!"}},{"$f":"INDEX($T$8:$AM$112,SMALL(IF(COUNTIF($T$5,$T$8:$AM$112),MATCH(ROW($T$8:$AM$112),ROW($T$8:$AM$112)),\"\"),ROWS($V$152:W154)),COLUMNS($V$152:W154))","v":{"$error":"#NUM!"}},{"$f":"INDEX($T$8:$AM$112,SMALL(IF(COUNTIF($T$5,$T$8:$AM$112),MATCH(ROW($T$8:$AM$112),ROW($T$8:$AM$112)),\"\"),ROWS($V$152:X154)),COLUMNS($V$152:X154))","v":{"$error":"#NUM!"}},{"$f":"INDEX($T$8:$AM$112,SMALL(IF(COUNTIF($T$5,$T$8:$AM$112),MATCH(ROW($T$8:$AM$112),ROW($T$8:$AM$112)),\"\"),ROWS($V$152:Y154)),COLUMNS($V$152:Y154))","v":{"$error":"#NUM!"}},{"$f":"INDEX($T$8:$AM$112,SMALL(IF(COUNTIF($T$5,$T$8:$AM$112),MATCH(ROW($T$8:$AM$112),ROW($T$8:$AM$112)),\"\"),ROWS($V$152:Z154)),COLUMNS($V$152:Z154))","v":{"$error":"#NUM!"}},{"$f":"INDEX($T$8:$AM$112,SMALL(IF(COUNTIF($T$5,$T$8:$AM$112),MATCH(ROW($T$8:$AM$112),ROW($T$8:$AM$112)),\"\"),ROWS($V$152:AA154)),COLUMNS($V$152:AA154))","v":{"$error":"#NUM!"}},{"$f":"INDEX($T$8:$AM$112,SMALL(IF(COUNTIF($T$5,$T$8:$AM$112),MATCH(ROW($T$8:$AM$112),ROW($T$8:$AM$112)),\"\"),ROWS($V$152:AB154)),COLUMNS($V$152:AB154))","v":{"$error":"#NUM!"}},{"$f":"INDEX($T$8:$AM$112,SMALL(IF(COUNTIF($T$5,$T$8:$AM$112),MATCH(ROW($T$8:$AM$112),ROW($T$8:$AM$112)),\"\"),ROWS($V$152:AC154)),COLUMNS($V$152:AC154))","v":{"$error":"#NUM!"}},{"$f":"INDEX($T$8:$AM$112,SMALL(IF(COUNTIF($T$5,$T$8:$AM$112),MATCH(ROW($T$8:$AM$112),ROW($T$8:$AM$112)),\"\"),ROWS($V$152:AD154)),COLUMNS($V$152:AD154))","v":{"$error":"#NUM!"}},{"$f":"INDEX($T$8:$AM$112,SMALL(IF(COUNTIF($T$5,$T$8:$AM$112),MATCH(ROW($T$8:$AM$112),ROW($T$8:$AM$112)),\"\"),ROWS($V$152:AE154)),COLUMNS($V$152:AE154))","v":{"$error":"#NUM!"}},{"$f":"INDEX($T$8:$AM$112,SMALL(IF(COUNTIF($T$5,$T$8:$AM$112),MATCH(ROW($T$8:$AM$112),ROW($T$8:$AM$112)),\"\"),ROWS($V$152:AF154)),COLUMNS($V$152:AF154))","v":{"$error":"#NUM!"}},{"$f":"INDEX($T$8:$AM$112,SMALL(IF(COUNTIF($T$5,$T$8:$AM$112),MATCH(ROW($T$8:$AM$112),ROW($T$8:$AM$112)),\"\"),ROWS($V$152:AG154)),COLUMNS($V$152:AG154))","v":{"$error":"#NUM!"}},{"$f":"INDEX($T$8:$AM$112,SMALL(IF(COUNTIF($T$5,$T$8:$AM$112),MATCH(ROW($T$8:$AM$112),ROW($T$8:$AM$112)),\"\"),ROWS($V$152:AH154)),COLUMNS($V$152:AH154))","v":{"$error":"#NUM!"}},{"$f":"INDEX($T$8:$AM$112,SMALL(IF(COUNTIF($T$5,$T$8:$AM$112),MATCH(ROW($T$8:$AM$112),ROW($T$8:$AM$112)),\"\"),ROWS($V$152:AI154)),COLUMNS($V$152:AI154))","v":{"$error":"#NUM!"}},{"$f":"INDEX($T$8:$AM$112,SMALL(IF(COUNTIF($T$5,$T$8:$AM$112),MATCH(ROW($T$8:$AM$112),ROW($T$8:$AM$112)),\"\"),ROWS($V$152:AJ154)),COLUMNS($V$152:AJ154))","v":{"$error":"#NUM!"}},{"$f":"INDEX($T$8:$AM$112,SMALL(IF(COUNTIF($T$5,$T$8:$AM$112),MATCH(ROW($T$8:$AM$112),ROW($T$8:$AM$112)),\"\"),ROWS($V$152:AK154)),COLUMNS($V$152:AK154))","v":{"$error":"#NUM!"}},{"$f":"INDEX($T$8:$AM$112,SMALL(IF(COUNTIF($T$5,$T$8:$AM$112),MATCH(ROW($T$8:$AM$112),ROW($T$8:$AM$112)),\"\"),ROWS($V$152:AL154)),COLUMNS($V$152:AL154))","v":{"$error":"#NUM!"}},{"$f":"INDEX($T$8:$AM$112,SMALL(IF(COUNTIF($T$5,$T$8:$AM$112),MATCH(ROW($T$8:$AM$112),ROW($T$8:$AM$112)),\"\"),ROWS($V$152:AM154)),COLUMNS($V$152:AM154))","v":{"$error":"#NUM!"}},{"$f":"INDEX($T$8:$AM$112,SMALL(IF(COUNTIF($T$5,$T$8:$AM$112),MATCH(ROW($T$8:$AM$112),ROW($T$8:$AM$112)),\"\"),ROWS($V$152:AN154)),COLUMNS($V$152:AN154))","v":{"$error":"#NUM!"}},{"$f":"INDEX($T$8:$AM$112,SMALL(IF(COUNTIF($T$5,$T$8:$AM$112),MATCH(ROW($T$8:$AM$112),ROW($T$8:$AM$112)),\"\"),ROWS($V$152:AO154)),COLUMNS($V$152:AO154))","v":{"$error":"#NUM!"}}]
["",null,"",null,"$",null,null,null,null,null,null,null,null,null,null,"$",null,null,null,{"$f":"INDEX($T$8:$AM$112,SMALL(IF(COUNTIF($T$5,$T$8:$AM$112),MATCH(ROW($T$8:$AM$112),ROW($T$8:$AM$112)),\"\"),ROWS(V$152:$V155)),COLUMNS(V$152:$V155))","v":{"$error":"#NUM!"}},{"$f":"INDEX($T$8:$AM$112,SMALL(IF(COUNTIF($T$5,$T$8:$AM$112),MATCH(ROW($T$8:$AM$112),ROW($T$8:$AM$112)),\"\"),ROWS($V$152:W155)),COLUMNS($V$152:W155))","v":{"$error":"#NUM!"}},{"$f":"INDEX($T$8:$AM$112,SMALL(IF(COUNTIF($T$5,$T$8:$AM$112),MATCH(ROW($T$8:$AM$112),ROW($T$8:$AM$112)),\"\"),ROWS($V$152:X155)),COLUMNS($V$152:X155))","v":{"$error":"#NUM!"}},{"$f":"INDEX($T$8:$AM$112,SMALL(IF(COUNTIF($T$5,$T$8:$AM$112),MATCH(ROW($T$8:$AM$112),ROW($T$8:$AM$112)),\"\"),ROWS($V$152:Y155)),COLUMNS($V$152:Y155))","v":{"$error":"#NUM!"}},{"$f":"INDEX($T$8:$AM$112,SMALL(IF(COUNTIF($T$5,$T$8:$AM$112),MATCH(ROW($T$8:$AM$112),ROW($T$8:$AM$112)),\"\"),ROWS($V$152:Z155)),COLUMNS($V$152:Z155))","v":{"$error":"#NUM!"}},{"$f":"INDEX($T$8:$AM$112,SMALL(IF(COUNTIF($T$5,$T$8:$AM$112),MATCH(ROW($T$8:$AM$112),ROW($T$8:$AM$112)),\"\"),ROWS($V$152:AA155)),COLUMNS($V$152:AA155))","v":{"$error":"#NUM!"}},{"$f":"INDEX($T$8:$AM$112,SMALL(IF(COUNTIF($T$5,$T$8:$AM$112),MATCH(ROW($T$8:$AM$112),ROW($T$8:$AM$112)),\"\"),ROWS($V$152:AB155)),COLUMNS($V$152:AB155))","v":{"$error":"#NUM!"}},{"$f":"INDEX($T$8:$AM$112,SMALL(IF(COUNTIF($T$5,$T$8:$AM$112),MATCH(ROW($T$8:$AM$112),ROW($T$8:$AM$112)),\"\"),ROWS($V$152:AC155)),COLUMNS($V$152:AC155))","v":{"$error":"#NUM!"}},{"$f":"INDEX($T$8:$AM$112,SMALL(IF(COUNTIF($T$5,$T$8:$AM$112),MATCH(ROW($T$8:$AM$112),ROW($T$8:$AM$112)),\"\"),ROWS($V$152:AD155)),COLUMNS($V$152:AD155))","v":{"$error":"#NUM!"}},{"$f":"INDEX($T$8:$AM$112,SMALL(IF(COUNTIF($T$5,$T$8:$AM$112),MATCH(ROW($T$8:$AM$112),ROW($T$8:$AM$112)),\"\"),ROWS($V$152:AE155)),COLUMNS($V$152:AE155))","v":{"$error":"#NUM!"}},{"$f":"INDEX($T$8:$AM$112,SMALL(IF(COUNTIF($T$5,$T$8:$AM$112),MATCH(ROW($T$8:$AM$112),ROW($T$8:$AM$112)),\"\"),ROWS($V$152:AF155)),COLUMNS($V$152:AF155))","v":{"$error":"#NUM!"}},{"$f":"INDEX($T$8:$AM$112,SMALL(IF(COUNTIF($T$5,$T$8:$AM$112),MATCH(ROW($T$8:$AM$112),ROW($T$8:$AM$112)),\"\"),ROWS($V$152:AG155)),COLUMNS($V$152:AG155))","v":{"$error":"#NUM!"}},{"$f":"INDEX($T$8:$AM$112,SMALL(IF(COUNTIF($T$5,$T$8:$AM$112),MATCH(ROW($T$8:$AM$112),ROW($T$8:$AM$112)),\"\"),ROWS($V$152:AH155)),COLUMNS($V$152:AH155))","v":{"$error":"#NUM!"}},{"$f":"INDEX($T$8:$AM$112,SMALL(IF(COUNTIF($T$5,$T$8:$AM$112),MATCH(ROW($T$8:$AM$112),ROW($T$8:$AM$112)),\"\"),ROWS($V$152:AI155)),COLUMNS($V$152:AI155))","v":{"$error":"#NUM!"}},{"$f":"INDEX($T$8:$AM$112,SMALL(IF(COUNTIF($T$5,$T$8:$AM$112),MATCH(ROW($T$8:$AM$112),ROW($T$8:$AM$112)),\"\"),ROWS($V$152:AJ155)),COLUMNS($V$152:AJ155))","v":{"$error":"#NUM!"}},{"$f":"INDEX($T$8:$AM$112,SMALL(IF(COUNTIF($T$5,$T$8:$AM$112),MATCH(ROW($T$8:$AM$112),ROW($T$8:$AM$112)),\"\"),ROWS($V$152:AK155)),COLUMNS($V$152:AK155))","v":{"$error":"#NUM!"}},{"$f":"INDEX($T$8:$AM$112,SMALL(IF(COUNTIF($T$5,$T$8:$AM$112),MATCH(ROW($T$8:$AM$112),ROW($T$8:$AM$112)),\"\"),ROWS($V$152:AL155)),COLUMNS($V$152:AL155))","v":{"$error":"#NUM!"}},{"$f":"INDEX($T$8:$AM$112,SMALL(IF(COUNTIF($T$5,$T$8:$AM$112),MATCH(ROW($T$8:$AM$112),ROW($T$8:$AM$112)),\"\"),ROWS($V$152:AM155)),COLUMNS($V$152:AM155))","v":{"$error":"#NUM!"}},{"$f":"INDEX($T$8:$AM$112,SMALL(IF(COUNTIF($T$5,$T$8:$AM$112),MATCH(ROW($T$8:$AM$112),ROW($T$8:$AM$112)),\"\"),ROWS($V$152:AN155)),COLUMNS($V$152:AN155))","v":{"$error":"#NUM!"}},{"$f":"INDEX($T$8:$AM$112,SMALL(IF(COUNTIF($T$5,$T$8:$AM$112),MATCH(ROW($T$8:$AM$112),ROW($T$8:$AM$112)),\"\"),ROWS($V$152:AO155)),COLUMNS($V$152:AO155))","v":{"$error":"#NUM!"}}]
["",null,"",null,"$",null,null,null,null,null,null,null,null,null,null,"$",null,null,null,{"$f":"INDEX($T$8:$AM$112,SMALL(IF(COUNTIF($T$5,$T$8:$AM$112),MATCH(ROW($T$8:$AM$112),ROW($T$8:$AM$112)),\"\"),ROWS(V$152:$V156)),COLUMNS(V$152:$V156))","v":{"$error":"#NUM!"}},{"$f":"INDEX($T$8:$AM$112,SMALL(IF(COUNTIF($T$5,$T$8:$AM$112),MATCH(ROW($T$8:$AM$112),ROW($T$8:$AM$112)),\"\"),ROWS($V$152:W156)),COLUMNS($V$152:W156))","v":{"$error":"#NUM!"}},{"$f":"INDEX($T$8:$AM$112,SMALL(IF(COUNTIF($T$5,$T$8:$AM$112),MATCH(ROW($T$8:$AM$112),ROW($T$8:$AM$112)),\"\"),ROWS($V$152:X156)),COLUMNS($V$152:X156))","v":{"$error":"#NUM!"}},{"$f":"INDEX($T$8:$AM$112,SMALL(IF(COUNTIF($T$5,$T$8:$AM$112),MATCH(ROW($T$8:$AM$112),ROW($T$8:$AM$112)),\"\"),ROWS($V$152:Y156)),COLUMNS($V$152:Y156))","v":{"$error":"#NUM!"}},{"$f":"INDEX($T$8:$AM$112,SMALL(IF(COUNTIF($T$5,$T$8:$AM$112),MATCH(ROW($T$8:$AM$112),ROW($T$8:$AM$112)),\"\"),ROWS($V$152:Z156)),COLUMNS($V$152:Z156))","v":{"$error":"#NUM!"}},{"$f":"INDEX($T$8:$AM$112,SMALL(IF(COUNTIF($T$5,$T$8:$AM$112),MATCH(ROW($T$8:$AM$112),ROW($T$8:$AM$112)),\"\"),ROWS($V$152:AA156)),COLUMNS($V$152:AA156))","v":{"$error":"#NUM!"}},{"$f":"INDEX($T$8:$AM$112,SMALL(IF(COUNTIF($T$5,$T$8:$AM$112),MATCH(ROW($T$8:$AM$112),ROW($T$8:$AM$112)),\"\"),ROWS($V$152:AB156)),COLUMNS($V$152:AB156))","v":{"$error":"#NUM!"}},{"$f":"INDEX($T$8:$AM$112,SMALL(IF(COUNTIF($T$5,$T$8:$AM$112),MATCH(ROW($T$8:$AM$112),ROW($T$8:$AM$112)),\"\"),ROWS($V$152:AC156)),COLUMNS($V$152:AC156))","v":{"$error":"#NUM!"}},{"$f":"INDEX($T$8:$AM$112,SMALL(IF(COUNTIF($T$5,$T$8:$AM$112),MATCH(ROW($T$8:$AM$112),ROW($T$8:$AM$112)),\"\"),ROWS($V$152:AD156)),COLUMNS($V$152:AD156))","v":{"$error":"#NUM!"}},{"$f":"INDEX($T$8:$AM$112,SMALL(IF(COUNTIF($T$5,$T$8:$AM$112),MATCH(ROW($T$8:$AM$112),ROW($T$8:$AM$112)),\"\"),ROWS($V$152:AE156)),COLUMNS($V$152:AE156))","v":{"$error":"#NUM!"}},{"$f":"INDEX($T$8:$AM$112,SMALL(IF(COUNTIF($T$5,$T$8:$AM$112),MATCH(ROW($T$8:$AM$112),ROW($T$8:$AM$112)),\"\"),ROWS($V$152:AF156)),COLUMNS($V$152:AF156))","v":{"$error":"#NUM!"}},{"$f":"INDEX($T$8:$AM$112,SMALL(IF(COUNTIF($T$5,$T$8:$AM$112),MATCH(ROW($T$8:$AM$112),ROW($T$8:$AM$112)),\"\"),ROWS($V$152:AG156)),COLUMNS($V$152:AG156))","v":{"$error":"#NUM!"}},{"$f":"INDEX($T$8:$AM$112,SMALL(IF(COUNTIF($T$5,$T$8:$AM$112),MATCH(ROW($T$8:$AM$112),ROW($T$8:$AM$112)),\"\"),ROWS($V$152:AH156)),COLUMNS($V$152:AH156))","v":{"$error":"#NUM!"}},{"$f":"INDEX($T$8:$AM$112,SMALL(IF(COUNTIF($T$5,$T$8:$AM$112),MATCH(ROW($T$8:$AM$112),ROW($T$8:$AM$112)),\"\"),ROWS($V$152:AI156)),COLUMNS($V$152:AI156))","v":{"$error":"#NUM!"}},{"$f":"INDEX($T$8:$AM$112,SMALL(IF(COUNTIF($T$5,$T$8:$AM$112),MATCH(ROW($T$8:$AM$112),ROW($T$8:$AM$112)),\"\"),ROWS($V$152:AJ156)),COLUMNS($V$152:AJ156))","v":{"$error":"#NUM!"}},{"$f":"INDEX($T$8:$AM$112,SMALL(IF(COUNTIF($T$5,$T$8:$AM$112),MATCH(ROW($T$8:$AM$112),ROW($T$8:$AM$112)),\"\"),ROWS($V$152:AK156)),COLUMNS($V$152:AK156))","v":{"$error":"#NUM!"}},{"$f":"INDEX($T$8:$AM$112,SMALL(IF(COUNTIF($T$5,$T$8:$AM$112),MATCH(ROW($T$8:$AM$112),ROW($T$8:$AM$112)),\"\"),ROWS($V$152:AL156)),COLUMNS($V$152:AL156))","v":{"$error":"#NUM!"}},{"$f":"INDEX($T$8:$AM$112,SMALL(IF(COUNTIF($T$5,$T$8:$AM$112),MATCH(ROW($T$8:$AM$112),ROW($T$8:$AM$112)),\"\"),ROWS($V$152:AM156)),COLUMNS($V$152:AM156))","v":{"$error":"#NUM!"}},{"$f":"INDEX($T$8:$AM$112,SMALL(IF(COUNTIF($T$5,$T$8:$AM$112),MATCH(ROW($T$8:$AM$112),ROW($T$8:$AM$112)),\"\"),ROWS($V$152:AN156)),COLUMNS($V$152:AN156))","v":{"$error":"#NUM!"}},{"$f":"INDEX($T$8:$AM$112,SMALL(IF(COUNTIF($T$5,$T$8:$AM$112),MATCH(ROW($T$8:$AM$112),ROW($T$8:$AM$112)),\"\"),ROWS($V$152:AO156)),COLUMNS($V$152:AO156))","v":{"$error":"#NUM!"}}]
["",null,"",null,"$",null,null,null,null,null,null,null,null,null,null,"$",null,null,null,{"$f":"INDEX($T$8:$AM$112,SMALL(IF(COUNTIF($T$5,$T$8:$AM$112),MATCH(ROW($T$8:$AM$112),ROW($T$8:$AM$112)),\"\"),ROWS(V$152:$V157)),COLUMNS(V$152:$V157))","v":{"$error":"#NUM!"}},{"$f":"INDEX($T$8:$AM$112,SMALL(IF(COUNTIF($T$5,$T$8:$AM$112),MATCH(ROW($T$8:$AM$112),ROW($T$8:$AM$112)),\"\"),ROWS($V$152:W157)),COLUMNS($V$152:W157))","v":{"$error":"#NUM!"}},{"$f":"INDEX($T$8:$AM$112,SMALL(IF(COUNTIF($T$5,$T$8:$AM$112),MATCH(ROW($T$8:$AM$112),ROW($T$8:$AM$112)),\"\"),ROWS($V$152:X157)),COLUMNS($V$152:X157))","v":{"$error":"#NUM!"}},{"$f":"INDEX($T$8:$AM$112,SMALL(IF(COUNTIF($T$5,$T$8:$AM$112),MATCH(ROW($T$8:$AM$112),ROW($T$8:$AM$112)),\"\"),ROWS($V$152:Y157)),COLUMNS($V$152:Y157))","v":{"$error":"#NUM!"}},{"$f":"INDEX($T$8:$AM$112,SMALL(IF(COUNTIF($T$5,$T$8:$AM$112),MATCH(ROW($T$8:$AM$112),ROW($T$8:$AM$112)),\"\"),ROWS($V$152:Z157)),COLUMNS($V$152:Z157))","v":{"$error":"#NUM!"}},{"$f":"INDEX($T$8:$AM$112,SMALL(IF(COUNTIF($T$5,$T$8:$AM$112),MATCH(ROW($T$8:$AM$112),ROW($T$8:$AM$112)),\"\"),ROWS($V$152:AA157)),COLUMNS($V$152:AA157))","v":{"$error":"#NUM!"}},{"$f":"INDEX($T$8:$AM$112,SMALL(IF(COUNTIF($T$5,$T$8:$AM$112),MATCH(ROW($T$8:$AM$112),ROW($T$8:$AM$112)),\"\"),ROWS($V$152:AB157)),COLUMNS($V$152:AB157))","v":{"$error":"#NUM!"}},{"$f":"INDEX($T$8:$AM$112,SMALL(IF(COUNTIF($T$5,$T$8:$AM$112),MATCH(ROW($T$8:$AM$112),ROW($T$8:$AM$112)),\"\"),ROWS($V$152:AC157)),COLUMNS($V$152:AC157))","v":{"$error":"#NUM!"}},{"$f":"INDEX($T$8:$AM$112,SMALL(IF(COUNTIF($T$5,$T$8:$AM$112),MATCH(ROW($T$8:$AM$112),ROW($T$8:$AM$112)),\"\"),ROWS($V$152:AD157)),COLUMNS($V$152:AD157))","v":{"$error":"#NUM!"}},{"$f":"INDEX($T$8:$AM$112,SMALL(IF(COUNTIF($T$5,$T$8:$AM$112),MATCH(ROW($T$8:$AM$112),ROW($T$8:$AM$112)),\"\"),ROWS($V$152:AE157)),COLUMNS($V$152:AE157))","v":{"$error":"#NUM!"}},{"$f":"INDEX($T$8:$AM$112,SMALL(IF(COUNTIF($T$5,$T$8:$AM$112),MATCH(ROW($T$8:$AM$112),ROW($T$8:$AM$112)),\"\"),ROWS($V$152:AF157)),COLUMNS($V$152:AF157))","v":{"$error":"#NUM!"}},{"$f":"INDEX($T$8:$AM$112,SMALL(IF(COUNTIF($T$5,$T$8:$AM$112),MATCH(ROW($T$8:$AM$112),ROW($T$8:$AM$112)),\"\"),ROWS($V$152:AG157)),COLUMNS($V$152:AG157))","v":{"$error":"#NUM!"}},{"$f":"INDEX($T$8:$AM$112,SMALL(IF(COUNTIF($T$5,$T$8:$AM$112),MATCH(ROW($T$8:$AM$112),ROW($T$8:$AM$112)),\"\"),ROWS($V$152:AH157)),COLUMNS($V$152:AH157))","v":{"$error":"#NUM!"}},{"$f":"INDEX($T$8:$AM$112,SMALL(IF(COUNTIF($T$5,$T$8:$AM$112),MATCH(ROW($T$8:$AM$112),ROW($T$8:$AM$112)),\"\"),ROWS($V$152:AI157)),COLUMNS($V$152:AI157))","v":{"$error":"#NUM!"}},{"$f":"INDEX($T$8:$AM$112,SMALL(IF(COUNTIF($T$5,$T$8:$AM$112),MATCH(ROW($T$8:$AM$112),ROW($T$8:$AM$112)),\"\"),ROWS($V$152:AJ157)),COLUMNS($V$152:AJ157))","v":{"$error":"#NUM!"}},{"$f":"INDEX($T$8:$AM$112,SMALL(IF(COUNTIF($T$5,$T$8:$AM$112),MATCH(ROW($T$8:$AM$112),ROW($T$8:$AM$112)),\"\"),ROWS($V$152:AK157)),COLUMNS($V$152:AK157))","v":{"$error":"#NUM!"}},{"$f":"INDEX($T$8:$AM$112,SMALL(IF(COUNTIF($T$5,$T$8:$AM$112),MATCH(ROW($T$8:$AM$112),ROW($T$8:$AM$112)),\"\"),ROWS($V$152:AL157)),COLUMNS($V$152:AL157))","v":{"$error":"#NUM!"}},{"$f":"INDEX($T$8:$AM$112,SMALL(IF(COUNTIF($T$5,$T$8:$AM$112),MATCH(ROW($T$8:$AM$112),ROW($T$8:$AM$112)),\"\"),ROWS($V$152:AM157)),COLUMNS($V$152:AM157))","v":{"$error":"#NUM!"}},{"$f":"INDEX($T$8:$AM$112,SMALL(IF(COUNTIF($T$5,$T$8:$AM$112),MATCH(ROW($T$8:$AM$112),ROW($T$8:$AM$112)),\"\"),ROWS($V$152:AN157)),COLUMNS($V$152:AN157))","v":{"$error":"#NUM!"}},{"$f":"INDEX($T$8:$AM$112,SMALL(IF(COUNTIF($T$5,$T$8:$AM$112),MATCH(ROW($T$8:$AM$112),ROW($T$8:$AM$112)),\"\"),ROWS($V$152:AO157)),COLUMNS($V$152:AO157))","v":{"$error":"#NUM!"}}]
["",null,"",null,"$",null,null,null,null,null,null,null,null,null,null,"$",null,null,null,{"$f":"INDEX($T$8:$AM$112,SMALL(IF(COUNTIF($T$5,$T$8:$AM$112),MATCH(ROW($T$8:$AM$112),ROW($T$8:$AM$112)),\"\"),ROWS(V$152:$V158)),COLUMNS(V$152:$V158))","v":{"$error":"#NUM!"}},{"$f":"INDEX($T$8:$AM$112,SMALL(IF(COUNTIF($T$5,$T$8:$AM$112),MATCH(ROW($T$8:$AM$112),ROW($T$8:$AM$112)),\"\"),ROWS($V$152:W158)),COLUMNS($V$152:W158))","v":{"$error":"#NUM!"}},{"$f":"INDEX($T$8:$AM$112,SMALL(IF(COUNTIF($T$5,$T$8:$AM$112),MATCH(ROW($T$8:$AM$112),ROW($T$8:$AM$112)),\"\"),ROWS($V$152:X158)),COLUMNS($V$152:X158))","v":{"$error":"#NUM!"}},{"$f":"INDEX($T$8:$AM$112,SMALL(IF(COUNTIF($T$5,$T$8:$AM$112),MATCH(ROW($T$8:$AM$112),ROW($T$8:$AM$112)),\"\"),ROWS($V$152:Y158)),COLUMNS($V$152:Y158))","v":{"$error":"#NUM!"}},{"$f":"INDEX($T$8:$AM$112,SMALL(IF(COUNTIF($T$5,$T$8:$AM$112),MATCH(ROW($T$8:$AM$112),ROW($T$8:$AM$112)),\"\"),ROWS($V$152:Z158)),COLUMNS($V$152:Z158))","v":{"$error":"#NUM!"}},{"$f":"INDEX($T$8:$AM$112,SMALL(IF(COUNTIF($T$5,$T$8:$AM$112),MATCH(ROW($T$8:$AM$112),ROW($T$8:$AM$112)),\"\"),ROWS($V$152:AA158)),COLUMNS($V$152:AA158))","v":{"$error":"#NUM!"}},{"$f":"INDEX($T$8:$AM$112,SMALL(IF(COUNTIF($T$5,$T$8:$AM$112),MATCH(ROW($T$8:$AM$112),ROW($T$8:$AM$112)),\"\"),ROWS($V$152:AB158)),COLUMNS($V$152:AB158))","v":{"$error":"#NUM!"}},{"$f":"INDEX($T$8:$AM$112,SMALL(IF(COUNTIF($T$5,$T$8:$AM$112),MATCH(ROW($T$8:$AM$112),ROW($T$8:$AM$112)),\"\"),ROWS($V$152:AC158)),COLUMNS($V$152:AC158))","v":{"$error":"#NUM!"}},{"$f":"INDEX($T$8:$AM$112,SMALL(IF(COUNTIF($T$5,$T$8:$AM$112),MATCH(ROW($T$8:$AM$112),ROW($T$8:$AM$112)),\"\"),ROWS($V$152:AD158)),COLUMNS($V$152:AD158))","v":{"$error":"#NUM!"}},{"$f":"INDEX($T$8:$AM$112,SMALL(IF(COUNTIF($T$5,$T$8:$AM$112),MATCH(ROW($T$8:$AM$112),ROW($T$8:$AM$112)),\"\"),ROWS($V$152:AE158)),COLUMNS($V$152:AE158))","v":{"$error":"#NUM!"}},{"$f":"INDEX($T$8:$AM$112,SMALL(IF(COUNTIF($T$5,$T$8:$AM$112),MATCH(ROW($T$8:$AM$112),ROW($T$8:$AM$112)),\"\"),ROWS($V$152:AF158)),COLUMNS($V$152:AF158))","v":{"$error":"#NUM!"}},{"$f":"INDEX($T$8:$AM$112,SMALL(IF(COUNTIF($T$5,$T$8:$AM$112),MATCH(ROW($T$8:$AM$112),ROW($T$8:$AM$112)),\"\"),ROWS($V$152:AG158)),COLUMNS($V$152:AG158))","v":{"$error":"#NUM!"}},{"$f":"INDEX($T$8:$AM$112,SMALL(IF(COUNTIF($T$5,$T$8:$AM$112),MATCH(ROW($T$8:$AM$112),ROW($T$8:$AM$112)),\"\"),ROWS($V$152:AH158)),COLUMNS($V$152:AH158))","v":{"$error":"#NUM!"}},{"$f":"INDEX($T$8:$AM$112,SMALL(IF(COUNTIF($T$5,$T$8:$AM$112),MATCH(ROW($T$8:$AM$112),ROW($T$8:$AM$112)),\"\"),ROWS($V$152:AI158)),COLUMNS($V$152:AI158))","v":{"$error":"#NUM!"}},{"$f":"INDEX($T$8:$AM$112,SMALL(IF(COUNTIF($T$5,$T$8:$AM$112),MATCH(ROW($T$8:$AM$112),ROW($T$8:$AM$112)),\"\"),ROWS($V$152:AJ158)),COLUMNS($V$152:AJ158))","v":{"$error":"#NUM!"}},{"$f":"INDEX($T$8:$AM$112,SMALL(IF(COUNTIF($T$5,$T$8:$AM$112),MATCH(ROW($T$8:$AM$112),ROW($T$8:$AM$112)),\"\"),ROWS($V$152:AK158)),COLUMNS($V$152:AK158))","v":{"$error":"#NUM!"}},{"$f":"INDEX($T$8:$AM$112,SMALL(IF(COUNTIF($T$5,$T$8:$AM$112),MATCH(ROW($T$8:$AM$112),ROW($T$8:$AM$112)),\"\"),ROWS($V$152:AL158)),COLUMNS($V$152:AL158))","v":{"$error":"#NUM!"}},{"$f":"INDEX($T$8:$AM$112,SMALL(IF(COUNTIF($T$5,$T$8:$AM$112),MATCH(ROW($T$8:$AM$112),ROW($T$8:$AM$112)),\"\"),ROWS($V$152:AM158)),COLUMNS($V$152:AM158))","v":{"$error":"#NUM!"}},{"$f":"INDEX($T$8:$AM$112,SMALL(IF(COUNTIF($T$5,$T$8:$AM$112),MATCH(ROW($T$8:$AM$112),ROW($T$8:$AM$112)),\"\"),ROWS($V$152:AN158)),COLUMNS($V$152:AN158))","v":{"$error":"#NUM!"}},{"$f":"INDEX($T$8:$AM$112,SMALL(IF(COUNTIF($T$5,$T$8:$AM$112),MATCH(ROW($T$8:$AM$112),ROW($T$8:$AM$112)),\"\"),ROWS($V$152:AO158)),COLUMNS($V$152:AO158))","v":{"$error":"#NUM!"}}]
["",null,"",null,"$",null,null,null,null,null,null,null,null,null,null,"$",null,null,null,{"$f":"INDEX($T$8:$AM$112,SMALL(IF(COUNTIF($T$5,$T$8:$AM$112),MATCH(ROW($T$8:$AM$112),ROW($T$8:$AM$112)),\"\"),ROWS(V$152:$V159)),COLUMNS(V$152:$V159))","v":{"$error":"#NUM!"}},{"$f":"INDEX($T$8:$AM$112,SMALL(IF(COUNTIF($T$5,$T$8:$AM$112),MATCH(ROW($T$8:$AM$112),ROW($T$8:$AM$112)),\"\"),ROWS($V$152:W159)),COLUMNS($V$152:W159))","v":{"$error":"#NUM!"}},{"$f":"INDEX($T$8:$AM$112,SMALL(IF(COUNTIF($T$5,$T$8:$AM$112),MATCH(ROW($T$8:$AM$112),ROW($T$8:$AM$112)),\"\"),ROWS($V$152:X159)),COLUMNS($V$152:X159))","v":{"$error":"#NUM!"}},{"$f":"INDEX($T$8:$AM$112,SMALL(IF(COUNTIF($T$5,$T$8:$AM$112),MATCH(ROW($T$8:$AM$112),ROW($T$8:$AM$112)),\"\"),ROWS($V$152:Y159)),COLUMNS($V$152:Y159))","v":{"$error":"#NUM!"}},{"$f":"INDEX($T$8:$AM$112,SMALL(IF(COUNTIF($T$5,$T$8:$AM$112),MATCH(ROW($T$8:$AM$112),ROW($T$8:$AM$112)),\"\"),ROWS($V$152:Z159)),COLUMNS($V$152:Z159))","v":{"$error":"#NUM!"}},{"$f":"INDEX($T$8:$AM$112,SMALL(IF(COUNTIF($T$5,$T$8:$AM$112),MATCH(ROW($T$8:$AM$112),ROW($T$8:$AM$112)),\"\"),ROWS($V$152:AA159)),COLUMNS($V$152:AA159))","v":{"$error":"#NUM!"}},{"$f":"INDEX($T$8:$AM$112,SMALL(IF(COUNTIF($T$5,$T$8:$AM$112),MATCH(ROW($T$8:$AM$112),ROW($T$8:$AM$112)),\"\"),ROWS($V$152:AB159)),COLUMNS($V$152:AB159))","v":{"$error":"#NUM!"}},{"$f":"INDEX($T$8:$AM$112,SMALL(IF(COUNTIF($T$5,$T$8:$AM$112),MATCH(ROW($T$8:$AM$112),ROW($T$8:$AM$112)),\"\"),ROWS($V$152:AC159)),COLUMNS($V$152:AC159))","v":{"$error":"#NUM!"}},{"$f":"INDEX($T$8:$AM$112,SMALL(IF(COUNTIF($T$5,$T$8:$AM$112),MATCH(ROW($T$8:$AM$112),ROW($T$8:$AM$112)),\"\"),ROWS($V$152:AD159)),COLUMNS($V$152:AD159))","v":{"$error":"#NUM!"}},{"$f":"INDEX($T$8:$AM$112,SMALL(IF(COUNTIF($T$5,$T$8:$AM$112),MATCH(ROW($T$8:$AM$112),ROW($T$8:$AM$112)),\"\"),ROWS($V$152:AE159)),COLUMNS($V$152:AE159))","v":{"$error":"#NUM!"}},{"$f":"INDEX($T$8:$AM$112,SMALL(IF(COUNTIF($T$5,$T$8:$AM$112),MATCH(ROW($T$8:$AM$112),ROW($T$8:$AM$112)),\"\"),ROWS($V$152:AF159)),COLUMNS($V$152:AF159))","v":{"$error":"#NUM!"}},{"$f":"INDEX($T$8:$AM$112,SMALL(IF(COUNTIF($T$5,$T$8:$AM$112),MATCH(ROW($T$8:$AM$112),ROW($T$8:$AM$112)),\"\"),ROWS($V$152:AG159)),COLUMNS($V$152:AG159))","v":{"$error":"#NUM!"}},{"$f":"INDEX($T$8:$AM$112,SMALL(IF(COUNTIF($T$5,$T$8:$AM$112),MATCH(ROW($T$8:$AM$112),ROW($T$8:$AM$112)),\"\"),ROWS($V$152:AH159)),COLUMNS($V$152:AH159))","v":{"$error":"#NUM!"}},{"$f":"INDEX($T$8:$AM$112,SMALL(IF(COUNTIF($T$5,$T$8:$AM$112),MATCH(ROW($T$8:$AM$112),ROW($T$8:$AM$112)),\"\"),ROWS($V$152:AI159)),COLUMNS($V$152:AI159))","v":{"$error":"#NUM!"}},{"$f":"INDEX($T$8:$AM$112,SMALL(IF(COUNTIF($T$5,$T$8:$AM$112),MATCH(ROW($T$8:$AM$112),ROW($T$8:$AM$112)),\"\"),ROWS($V$152:AJ159)),COLUMNS($V$152:AJ159))","v":{"$error":"#NUM!"}},{"$f":"INDEX($T$8:$AM$112,SMALL(IF(COUNTIF($T$5,$T$8:$AM$112),MATCH(ROW($T$8:$AM$112),ROW($T$8:$AM$112)),\"\"),ROWS($V$152:AK159)),COLUMNS($V$152:AK159))","v":{"$error":"#NUM!"}},{"$f":"INDEX($T$8:$AM$112,SMALL(IF(COUNTIF($T$5,$T$8:$AM$112),MATCH(ROW($T$8:$AM$112),ROW($T$8:$AM$112)),\"\"),ROWS($V$152:AL159)),COLUMNS($V$152:AL159))","v":{"$error":"#NUM!"}},{"$f":"INDEX($T$8:$AM$112,SMALL(IF(COUNTIF($T$5,$T$8:$AM$112),MATCH(ROW($T$8:$AM$112),ROW($T$8:$AM$112)),\"\"),ROWS($V$152:AM159)),COLUMNS($V$152:AM159))","v":{"$error":"#NUM!"}},{"$f":"INDEX($T$8:$AM$112,SMALL(IF(COUNTIF($T$5,$T$8:$AM$112),MATCH(ROW($T$8:$AM$112),ROW($T$8:$AM$112)),\"\"),ROWS($V$152:AN159)),COLUMNS($V$152:AN159))","v":{"$error":"#NUM!"}},{"$f":"INDEX($T$8:$AM$112,SMALL(IF(COUNTIF($T$5,$T$8:$AM$112),MATCH(ROW($T$8:$AM$112),ROW($T$8:$AM$112)),\"\"),ROWS($V$152:AO159)),COLUMNS($V$152:AO159))","v":{"$error":"#NUM!"}}]
["",null,"",null,"$",null,null,null,null,null,null,null,null,null,null,"$",null,null,null,{"$f":"INDEX($T$8:$AM$112,SMALL(IF(COUNTIF($T$5,$T$8:$AM$112),MATCH(ROW($T$8:$AM$112),ROW($T$8:$AM$112)),\"\"),ROWS(V$152:$V160)),COLUMNS(V$152:$V160))","v":{"$error":"#NUM!"}},{"$f":"INDEX($T$8:$AM$112,SMALL(IF(COUNTIF($T$5,$T$8:$AM$112),MATCH(ROW($T$8:$AM$112),ROW($T$8:$AM$112)),\"\"),ROWS($V$152:W160)),COLUMNS($V$152:W160))","v":{"$error":"#NUM!"}},{"$f":"INDEX($T$8:$AM$112,SMALL(IF(COUNTIF($T$5,$T$8:$AM$112),MATCH(ROW($T$8:$AM$112),ROW($T$8:$AM$112)),\"\"),ROWS($V$152:X160)),COLUMNS($V$152:X160))","v":{"$error":"#NUM!"}},{"$f":"INDEX($T$8:$AM$112,SMALL(IF(COUNTIF($T$5,$T$8:$AM$112),MATCH(ROW($T$8:$AM$112),ROW($T$8:$AM$112)),\"\"),ROWS($V$152:Y160)),COLUMNS($V$152:Y160))","v":{"$error":"#NUM!"}},{"$f":"INDEX($T$8:$AM$112,SMALL(IF(COUNTIF($T$5,$T$8:$AM$112),MATCH(ROW($T$8:$AM$112),ROW($T$8:$AM$112)),\"\"),ROWS($V$152:Z160)),COLUMNS($V$152:Z160))","v":{"$error":"#NUM!"}},{"$f":"INDEX($T$8:$AM$112,SMALL(IF(COUNTIF($T$5,$T$8:$AM$112),MATCH(ROW($T$8:$AM$112),ROW($T$8:$AM$112)),\"\"),ROWS($V$152:AA160)),COLUMNS($V$152:AA160))","v":{"$error":"#NUM!"}},{"$f":"INDEX($T$8:$AM$112,SMALL(IF(COUNTIF($T$5,$T$8:$AM$112),MATCH(ROW($T$8:$AM$112),ROW($T$8:$AM$112)),\"\"),ROWS($V$152:AB160)),COLUMNS($V$152:AB160))","v":{"$error":"#NUM!"}},{"$f":"INDEX($T$8:$AM$112,SMALL(IF(COUNTIF($T$5,$T$8:$AM$112),MATCH(ROW($T$8:$AM$112),ROW($T$8:$AM$112)),\"\"),ROWS($V$152:AC160)),COLUMNS($V$152:AC160))","v":{"$error":"#NUM!"}},{"$f":"INDEX($T$8:$AM$112,SMALL(IF(COUNTIF($T$5,$T$8:$AM$112),MATCH(ROW($T$8:$AM$112),ROW($T$8:$AM$112)),\"\"),ROWS($V$152:AD160)),COLUMNS($V$152:AD160))","v":{"$error":"#NUM!"}},{"$f":"INDEX($T$8:$AM$112,SMALL(IF(COUNTIF($T$5,$T$8:$AM$112),MATCH(ROW($T$8:$AM$112),ROW($T$8:$AM$112)),\"\"),ROWS($V$152:AE160)),COLUMNS($V$152:AE160))","v":{"$error":"#NUM!"}},{"$f":"INDEX($T$8:$AM$112,SMALL(IF(COUNTIF($T$5,$T$8:$AM$112),MATCH(ROW($T$8:$AM$112),ROW($T$8:$AM$112)),\"\"),ROWS($V$152:AF160)),COLUMNS($V$152:AF160))","v":{"$error":"#NUM!"}},{"$f":"INDEX($T$8:$AM$112,SMALL(IF(COUNTIF($T$5,$T$8:$AM$112),MATCH(ROW($T$8:$AM$112),ROW($T$8:$AM$112)),\"\"),ROWS($V$152:AG160)),COLUMNS($V$152:AG160))","v":{"$error":"#NUM!"}},{"$f":"INDEX($T$8:$AM$112,SMALL(IF(COUNTIF($T$5,$T$8:$AM$112),MATCH(ROW($T$8:$AM$112),ROW($T$8:$AM$112)),\"\"),ROWS($V$152:AH160)),COLUMNS($V$152:AH160))","v":{"$error":"#NUM!"}},{"$f":"INDEX($T$8:$AM$112,SMALL(IF(COUNTIF($T$5,$T$8:$AM$112),MATCH(ROW($T$8:$AM$112),ROW($T$8:$AM$112)),\"\"),ROWS($V$152:AI160)),COLUMNS($V$152:AI160))","v":{"$error":"#NUM!"}},{"$f":"INDEX($T$8:$AM$112,SMALL(IF(COUNTIF($T$5,$T$8:$AM$112),MATCH(ROW($T$8:$AM$112),ROW($T$8:$AM$112)),\"\"),ROWS($V$152:AJ160)),COLUMNS($V$152:AJ160))","v":{"$error":"#NUM!"}},{"$f":"INDEX($T$8:$AM$112,SMALL(IF(COUNTIF($T$5,$T$8:$AM$112),MATCH(ROW($T$8:$AM$112),ROW($T$8:$AM$112)),\"\"),ROWS($V$152:AK160)),COLUMNS($V$152:AK160))","v":{"$error":"#NUM!"}},{"$f":"INDEX($T$8:$AM$112,SMALL(IF(COUNTIF($T$5,$T$8:$AM$112),MATCH(ROW($T$8:$AM$112),ROW($T$8:$AM$112)),\"\"),ROWS($V$152:AL160)),COLUMNS($V$152:AL160))","v":{"$error":"#NUM!"}},{"$f":"INDEX($T$8:$AM$112,SMALL(IF(COUNTIF($T$5,$T$8:$AM$112),MATCH(ROW($T$8:$AM$112),ROW($T$8:$AM$112)),\"\"),ROWS($V$152:AM160)),COLUMNS($V$152:AM160))","v":{"$error":"#NUM!"}},{"$f":"INDEX($T$8:$AM$112,SMALL(IF(COUNTIF($T$5,$T$8:$AM$112),MATCH(ROW($T$8:$AM$112),ROW($T$8:$AM$112)),\"\"),ROWS($V$152:AN160)),COLUMNS($V$152:AN160))","v":{"$error":"#NUM!"}},{"$f":"INDEX($T$8:$AM$112,SMALL(IF(COUNTIF($T$5,$T$8:$AM$112),MATCH(ROW($T$8:$AM$112),ROW($T$8:$AM$112)),\"\"),ROWS($V$152:AO160)),COLUMNS($V$152:AO160))","v":{"$error":"#NUM!"}}]
["",null,"",null,"$",null,null,null,null,null,null,null,null,null,null,"$",null,null,null,{"$f":"INDEX($T$8:$AM$112,SMALL(IF(COUNTIF($T$5,$T$8:$AM$112),MATCH(ROW($T$8:$AM$112),ROW($T$8:$AM$112)),\"\"),ROWS(V$152:$V161)),COLUMNS(V$152:$V161))","v":{"$error":"#NUM!"}},{"$f":"INDEX($T$8:$AM$112,SMALL(IF(COUNTIF($T$5,$T$8:$AM$112),MATCH(ROW($T$8:$AM$112),ROW($T$8:$AM$112)),\"\"),ROWS($V$152:W161)),COLUMNS($V$152:W161))","v":{"$error":"#NUM!"}},{"$f":"INDEX($T$8:$AM$112,SMALL(IF(COUNTIF($T$5,$T$8:$AM$112),MATCH(ROW($T$8:$AM$112),ROW($T$8:$AM$112)),\"\"),ROWS($V$152:X161)),COLUMNS($V$152:X161))","v":{"$error":"#NUM!"}},{"$f":"INDEX($T$8:$AM$112,SMALL(IF(COUNTIF($T$5,$T$8:$AM$112),MATCH(ROW($T$8:$AM$112),ROW($T$8:$AM$112)),\"\"),ROWS($V$152:Y161)),COLUMNS($V$152:Y161))","v":{"$error":"#NUM!"}},{"$f":"INDEX($T$8:$AM$112,SMALL(IF(COUNTIF($T$5,$T$8:$AM$112),MATCH(ROW($T$8:$AM$112),ROW($T$8:$AM$112)),\"\"),ROWS($V$152:Z161)),COLUMNS($V$152:Z161))","v":{"$error":"#NUM!"}},{"$f":"INDEX($T$8:$AM$112,SMALL(IF(COUNTIF($T$5,$T$8:$AM$112),MATCH(ROW($T$8:$AM$112),ROW($T$8:$AM$112)),\"\"),ROWS($V$152:AA161)),COLUMNS($V$152:AA161))","v":{"$error":"#NUM!"}},{"$f":"INDEX($T$8:$AM$112,SMALL(IF(COUNTIF($T$5,$T$8:$AM$112),MATCH(ROW($T$8:$AM$112),ROW($T$8:$AM$112)),\"\"),ROWS($V$152:AB161)),COLUMNS($V$152:AB161))","v":{"$error":"#NUM!"}},{"$f":"INDEX($T$8:$AM$112,SMALL(IF(COUNTIF($T$5,$T$8:$AM$112),MATCH(ROW($T$8:$AM$112),ROW($T$8:$AM$112)),\"\"),ROWS($V$152:AC161)),COLUMNS($V$152:AC161))","v":{"$error":"#NUM!"}},{"$f":"INDEX($T$8:$AM$112,SMALL(IF(COUNTIF($T$5,$T$8:$AM$112),MATCH(ROW($T$8:$AM$112),ROW($T$8:$AM$112)),\"\"),ROWS($V$152:AD161)),COLUMNS($V$152:AD161))","v":{"$error":"#NUM!"}},{"$f":"INDEX($T$8:$AM$112,SMALL(IF(COUNTIF($T$5,$T$8:$AM$112),MATCH(ROW($T$8:$AM$112),ROW($T$8:$AM$112)),\"\"),ROWS($V$152:AE161)),COLUMNS($V$152:AE161))","v":{"$error":"#NUM!"}},{"$f":"INDEX($T$8:$AM$112,SMALL(IF(COUNTIF($T$5,$T$8:$AM$112),MATCH(ROW($T$8:$AM$112),ROW($T$8:$AM$112)),\"\"),ROWS($V$152:AF161)),COLUMNS($V$152:AF161))","v":{"$error":"#NUM!"}},{"$f":"INDEX($T$8:$AM$112,SMALL(IF(COUNTIF($T$5,$T$8:$AM$112),MATCH(ROW($T$8:$AM$112),ROW($T$8:$AM$112)),\"\"),ROWS($V$152:AG161)),COLUMNS($V$152:AG161))","v":{"$error":"#NUM!"}},{"$f":"INDEX($T$8:$AM$112,SMALL(IF(COUNTIF($T$5,$T$8:$AM$112),MATCH(ROW($T$8:$AM$112),ROW($T$8:$AM$112)),\"\"),ROWS($V$152:AH161)),COLUMNS($V$152:AH161))","v":{"$error":"#NUM!"}},{"$f":"INDEX($T$8:$AM$112,SMALL(IF(COUNTIF($T$5,$T$8:$AM$112),MATCH(ROW($T$8:$AM$112),ROW($T$8:$AM$112)),\"\"),ROWS($V$152:AI161)),COLUMNS($V$152:AI161))","v":{"$error":"#NUM!"}},{"$f":"INDEX($T$8:$AM$112,SMALL(IF(COUNTIF($T$5,$T$8:$AM$112),MATCH(ROW($T$8:$AM$112),ROW($T$8:$AM$112)),\"\"),ROWS($V$152:AJ161)),COLUMNS($V$152:AJ161))","v":{"$error":"#NUM!"}},{"$f":"INDEX($T$8:$AM$112,SMALL(IF(COUNTIF($T$5,$T$8:$AM$112),MATCH(ROW($T$8:$AM$112),ROW($T$8:$AM$112)),\"\"),ROWS($V$152:AK161)),COLUMNS($V$152:AK161))","v":{"$error":"#NUM!"}},{"$f":"INDEX($T$8:$AM$112,SMALL(IF(COUNTIF($T$5,$T$8:$AM$112),MATCH(ROW($T$8:$AM$112),ROW($T$8:$AM$112)),\"\"),ROWS($V$152:AL161)),COLUMNS($V$152:AL161))","v":{"$error":"#NUM!"}},{"$f":"INDEX($T$8:$AM$112,SMALL(IF(COUNTIF($T$5,$T$8:$AM$112),MATCH(ROW($T$8:$AM$112),ROW($T$8:$AM$112)),\"\"),ROWS($V$152:AM161)),COLUMNS($V$152:AM161))","v":{"$error":"#NUM!"}},{"$f":"INDEX($T$8:$AM$112,SMALL(IF(COUNTIF($T$5,$T$8:$AM$112),MATCH(ROW($T$8:$AM$112),ROW($T$8:$AM$112)),\"\"),ROWS($V$152:AN161)),COLUMNS($V$152:AN161))","v":{"$error":"#NUM!"}},{"$f":"INDEX($T$8:$AM$112,SMALL(IF(COUNTIF($T$5,$T$8:$AM$112),MATCH(ROW($T$8:$AM$112),ROW($T$8:$AM$112)),\"\"),ROWS($V$152:AO161)),COLUMNS($V$152:AO161))","v":{"$error":"#NUM!"}}]
["",null,"",null,"$",null,null,null,null,null,null,null,null,null,null,"$",null,null,null,{"$f":"INDEX($T$8:$AM$112,SMALL(IF(COUNTIF($T$5,$T$8:$AM$112),MATCH(ROW($T$8:$AM$112),ROW($T$8:$AM$112)),\"\"),ROWS(V$152:$V162)),COLUMNS(V$152:$V162))","v":{"$error":"#NUM!"}},{"$f":"INDEX($T$8:$AM$112,SMALL(IF(COUNTIF($T$5,$T$8:$AM$112),MATCH(ROW($T$8:$AM$112),ROW($T$8:$AM$112)),\"\"),ROWS($V$152:W162)),COLUMNS($V$152:W162))","v":{"$error":"#NUM!"}},{"$f":"INDEX($T$8:$AM$112,SMALL(IF(COUNTIF($T$5,$T$8:$AM$112),MATCH(ROW($T$8:$AM$112),ROW($T$8:$AM$112)),\"\"),ROWS($V$152:X162)),COLUMNS($V$152:X162))","v":{"$error":"#NUM!"}},{"$f":"INDEX($T$8:$AM$112,SMALL(IF(COUNTIF($T$5,$T$8:$AM$112),MATCH(ROW($T$8:$AM$112),ROW($T$8:$AM$112)),\"\"),ROWS($V$152:Y162)),COLUMNS($V$152:Y162))","v":{"$error":"#NUM!"}},{"$f":"INDEX($T$8:$AM$112,SMALL(IF(COUNTIF($T$5,$T$8:$AM$112),MATCH(ROW($T$8:$AM$112),ROW($T$8:$AM$112)),\"\"),ROWS($V$152:Z162)),COLUMNS($V$152:Z162))","v":{"$error":"#NUM!"}},{"$f":"INDEX($T$8:$AM$112,SMALL(IF(COUNTIF($T$5,$T$8:$AM$112),MATCH(ROW($T$8:$AM$112),ROW($T$8:$AM$112)),\"\"),ROWS($V$152:AA162)),COLUMNS($V$152:AA162))","v":{"$error":"#NUM!"}},{"$f":"INDEX($T$8:$AM$112,SMALL(IF(COUNTIF($T$5,$T$8:$AM$112),MATCH(ROW($T$8:$AM$112),ROW($T$8:$AM$112)),\"\"),ROWS($V$152:AB162)),COLUMNS($V$152:AB162))","v":{"$error":"#NUM!"}},{"$f":"INDEX($T$8:$AM$112,SMALL(IF(COUNTIF($T$5,$T$8:$AM$112),MATCH(ROW($T$8:$AM$112),ROW($T$8:$AM$112)),\"\"),ROWS($V$152:AC162)),COLUMNS($V$152:AC162))","v":{"$error":"#NUM!"}},{"$f":"INDEX($T$8:$AM$112,SMALL(IF(COUNTIF($T$5,$T$8:$AM$112),MATCH(ROW($T$8:$AM$112),ROW($T$8:$AM$112)),\"\"),ROWS($V$152:AD162)),COLUMNS($V$152:AD162))","v":{"$error":"#NUM!"}},{"$f":"INDEX($T$8:$AM$112,SMALL(IF(COUNTIF($T$5,$T$8:$AM$112),MATCH(ROW($T$8:$AM$112),ROW($T$8:$AM$112)),\"\"),ROWS($V$152:AE162)),COLUMNS($V$152:AE162))","v":{"$error":"#NUM!"}},{"$f":"INDEX($T$8:$AM$112,SMALL(IF(COUNTIF($T$5,$T$8:$AM$112),MATCH(ROW($T$8:$AM$112),ROW($T$8:$AM$112)),\"\"),ROWS($V$152:AF162)),COLUMNS($V$152:AF162))","v":{"$error":"#NUM!"}},{"$f":"INDEX($T$8:$AM$112,SMALL(IF(COUNTIF($T$5,$T$8:$AM$112),MATCH(ROW($T$8:$AM$112),ROW($T$8:$AM$112)),\"\"),ROWS($V$152:AG162)),COLUMNS($V$152:AG162))","v":{"$error":"#NUM!"}},{"$f":"INDEX($T$8:$AM$112,SMALL(IF(COUNTIF($T$5,$T$8:$AM$112),MATCH(ROW($T$8:$AM$112),ROW($T$8:$AM$112)),\"\"),ROWS($V$152:AH162)),COLUMNS($V$152:AH162))","v":{"$error":"#NUM!"}},{"$f":"INDEX($T$8:$AM$112,SMALL(IF(COUNTIF($T$5,$T$8:$AM$112),MATCH(ROW($T$8:$AM$112),ROW($T$8:$AM$112)),\"\"),ROWS($V$152:AI162)),COLUMNS($V$152:AI162))","v":{"$error":"#NUM!"}},{"$f":"INDEX($T$8:$AM$112,SMALL(IF(COUNTIF($T$5,$T$8:$AM$112),MATCH(ROW($T$8:$AM$112),ROW($T$8:$AM$112)),\"\"),ROWS($V$152:AJ162)),COLUMNS($V$152:AJ162))","v":{"$error":"#NUM!"}},{"$f":"INDEX($T$8:$AM$112,SMALL(IF(COUNTIF($T$5,$T$8:$AM$112),MATCH(ROW($T$8:$AM$112),ROW($T$8:$AM$112)),\"\"),ROWS($V$152:AK162)),COLUMNS($V$152:AK162))","v":{"$error":"#NUM!"}},{"$f":"INDEX($T$8:$AM$112,SMALL(IF(COUNTIF($T$5,$T$8:$AM$112),MATCH(ROW($T$8:$AM$112),ROW($T$8:$AM$112)),\"\"),ROWS($V$152:AL162)),COLUMNS($V$152:AL162))","v":{"$error":"#NUM!"}},{"$f":"INDEX($T$8:$AM$112,SMALL(IF(COUNTIF($T$5,$T$8:$AM$112),MATCH(ROW($T$8:$AM$112),ROW($T$8:$AM$112)),\"\"),ROWS($V$152:AM162)),COLUMNS($V$152:AM162))","v":{"$error":"#NUM!"}},{"$f":"INDEX($T$8:$AM$112,SMALL(IF(COUNTIF($T$5,$T$8:$AM$112),MATCH(ROW($T$8:$AM$112),ROW($T$8:$AM$112)),\"\"),ROWS($V$152:AN162)),COLUMNS($V$152:AN162))","v":{"$error":"#NUM!"}},{"$f":"INDEX($T$8:$AM$112,SMALL(IF(COUNTIF($T$5,$T$8:$AM$112),MATCH(ROW($T$8:$AM$112),ROW($T$8:$AM$112)),\"\"),ROWS($V$152:AO162)),COLUMNS($V$152:AO162))","v":{"$error":"#NUM!"}}]
["",null,"",null,"$",null,null,null,null,null,null,null,null,null,null,"$",null,null,null,{"$f":"INDEX($T$8:$AM$112,SMALL(IF(COUNTIF($T$5,$T$8:$AM$112),MATCH(ROW($T$8:$AM$112),ROW($T$8:$AM$112)),\"\"),ROWS(V$152:$V163)),COLUMNS(V$152:$V163))","v":{"$error":"#NUM!"}},{"$f":"INDEX($T$8:$AM$112,SMALL(IF(COUNTIF($T$5,$T$8:$AM$112),MATCH(ROW($T$8:$AM$112),ROW($T$8:$AM$112)),\"\"),ROWS($V$152:W163)),COLUMNS($V$152:W163))","v":{"$error":"#NUM!"}},{"$f":"INDEX($T$8:$AM$112,SMALL(IF(COUNTIF($T$5,$T$8:$AM$112),MATCH(ROW($T$8:$AM$112),ROW($T$8:$AM$112)),\"\"),ROWS($V$152:X163)),COLUMNS($V$152:X163))","v":{"$error":"#NUM!"}},{"$f":"INDEX($T$8:$AM$112,SMALL(IF(COUNTIF($T$5,$T$8:$AM$112),MATCH(ROW($T$8:$AM$112),ROW($T$8:$AM$112)),\"\"),ROWS($V$152:Y163)),COLUMNS($V$152:Y163))","v":{"$error":"#NUM!"}},{"$f":"INDEX($T$8:$AM$112,SMALL(IF(COUNTIF($T$5,$T$8:$AM$112),MATCH(ROW($T$8:$AM$112),ROW($T$8:$AM$112)),\"\"),ROWS($V$152:Z163)),COLUMNS($V$152:Z163))","v":{"$error":"#NUM!"}},{"$f":"INDEX($T$8:$AM$112,SMALL(IF(COUNTIF($T$5,$T$8:$AM$112),MATCH(ROW($T$8:$AM$112),ROW($T$8:$AM$112)),\"\"),ROWS($V$152:AA163)),COLUMNS($V$152:AA163))","v":{"$error":"#NUM!"}},{"$f":"INDEX($T$8:$AM$112,SMALL(IF(COUNTIF($T$5,$T$8:$AM$112),MATCH(ROW($T$8:$AM$112),ROW($T$8:$AM$112)),\"\"),ROWS($V$152:AB163)),COLUMNS($V$152:AB163))","v":{"$error":"#NUM!"}},{"$f":"INDEX($T$8:$AM$112,SMALL(IF(COUNTIF($T$5,$T$8:$AM$112),MATCH(ROW($T$8:$AM$112),ROW($T$8:$AM$112)),\"\"),ROWS($V$152:AC163)),COLUMNS($V$152:AC163))","v":{"$error":"#NUM!"}},{"$f":"INDEX($T$8:$AM$112,SMALL(IF(COUNTIF($T$5,$T$8:$AM$112),MATCH(ROW($T$8:$AM$112),ROW($T$8:$AM$112)),\"\"),ROWS($V$152:AD163)),COLUMNS($V$152:AD163))","v":{"$error":"#NUM!"}},{"$f":"INDEX($T$8:$AM$112,SMALL(IF(COUNTIF($T$5,$T$8:$AM$112),MATCH(ROW($T$8:$AM$112),ROW($T$8:$AM$112)),\"\"),ROWS($V$152:AE163)),COLUMNS($V$152:AE163))","v":{"$error":"#NUM!"}},{"$f":"INDEX($T$8:$AM$112,SMALL(IF(COUNTIF($T$5,$T$8:$AM$112),MATCH(ROW($T$8:$AM$112),ROW($T$8:$AM$112)),\"\"),ROWS($V$152:AF163)),COLUMNS($V$152:AF163))","v":{"$error":"#NUM!"}},{"$f":"INDEX($T$8:$AM$112,SMALL(IF(COUNTIF($T$5,$T$8:$AM$112),MATCH(ROW($T$8:$AM$112),ROW($T$8:$AM$112)),\"\"),ROWS($V$152:AG163)),COLUMNS($V$152:AG163))","v":{"$error":"#NUM!"}},{"$f":"INDEX($T$8:$AM$112,SMALL(IF(COUNTIF($T$5,$T$8:$AM$112),MATCH(ROW($T$8:$AM$112),ROW($T$8:$AM$112)),\"\"),ROWS($V$152:AH163)),COLUMNS($V$152:AH163))","v":{"$error":"#NUM!"}},{"$f":"INDEX($T$8:$AM$112,SMALL(IF(COUNTIF($T$5,$T$8:$AM$112),MATCH(ROW($T$8:$AM$112),ROW($T$8:$AM$112)),\"\"),ROWS($V$152:AI163)),COLUMNS($V$152:AI163))","v":{"$error":"#NUM!"}},{"$f":"INDEX($T$8:$AM$112,SMALL(IF(COUNTIF($T$5,$T$8:$AM$112),MATCH(ROW($T$8:$AM$112),ROW($T$8:$AM$112)),\"\"),ROWS($V$152:AJ163)),COLUMNS($V$152:AJ163))","v":{"$error":"#NUM!"}},{"$f":"INDEX($T$8:$AM$112,SMALL(IF(COUNTIF($T$5,$T$8:$AM$112),MATCH(ROW($T$8:$AM$112),ROW($T$8:$AM$112)),\"\"),ROWS($V$152:AK163)),COLUMNS($V$152:AK163))","v":{"$error":"#NUM!"}},{"$f":"INDEX($T$8:$AM$112,SMALL(IF(COUNTIF($T$5,$T$8:$AM$112),MATCH(ROW($T$8:$AM$112),ROW($T$8:$AM$112)),\"\"),ROWS($V$152:AL163)),COLUMNS($V$152:AL163))","v":{"$error":"#NUM!"}},{"$f":"INDEX($T$8:$AM$112,SMALL(IF(COUNTIF($T$5,$T$8:$AM$112),MATCH(ROW($T$8:$AM$112),ROW($T$8:$AM$112)),\"\"),ROWS($V$152:AM163)),COLUMNS($V$152:AM163))","v":{"$error":"#NUM!"}},{"$f":"INDEX($T$8:$AM$112,SMALL(IF(COUNTIF($T$5,$T$8:$AM$112),MATCH(ROW($T$8:$AM$112),ROW($T$8:$AM$112)),\"\"),ROWS($V$152:AN163)),COLUMNS($V$152:AN163))","v":{"$error":"#NUM!"}},{"$f":"INDEX($T$8:$AM$112,SMALL(IF(COUNTIF($T$5,$T$8:$AM$112),MATCH(ROW($T$8:$AM$112),ROW($T$8:$AM$112)),\"\"),ROWS($V$152:AO163)),COLUMNS($V$152:AO163))","v":{"$error":"#NUM!"}}]
["Self- Perform Subtotal (Must not Exceed 20% of Total Amount)",null,null,null,null,null,null,null,null,null,null,"Percent of Total:",{"$f":"IFERROR(Q160/(Q160+Q114),\"\")","v":""},null,null,"Lump Sum",{"$f":"Q148","v":0},null,null,null,null,null,null,null,null,null,null,null,null,null,null,null,null,null,null,null,null,null,null,null,null,null,null,null,null,null,null,null,null,null,"Add sep total for Laborer"]
[null,null,null,null,null,null,null,null,null,null,null,null,null,null,null,null,null,null,null,null,null,null,null,null,null,null,null,null,null,null,null,null,null,null,null,null,null,null,null,null,null,null,null,null,null,null,null,null,null,null,"Same for GMP"]
[null,null,null,null,null,null,null,null,null,null,null,null,null,null,null,"Total Amount",{"$f":"Q160+Q114+Q144","v":0}]
[null,null,null,null,null,null,null,null,null,null,null,null,null,null,null,null,null,null,null,null,{"$f":"IF(OR($M$160=\"\",$M$160<0.2),FALSE,TRUE)","v":false}]
["Detail the Reason Self-Performed Total Exceeds 20%"]
[]
[]
[]
[]
[]
[]
["C.2. CM General Conditions"]
[]
["Description",null,null,null,null,null,null,null,null,null,null,null,null,null,null,null,"Amount"]
[null,null,null,null,null,null,null,null,null,null,null,null,null,null,null,null,null,null,null,null,null,null,null,null,null,null,null,null,null,null,null,null,null,null,null,null,null,null,null,null,null,null,null,null,null,null,null,null,null,"*"]
["Deliveries",null,null,null,null,null,null,null,null,null,null,null,null,null,null,null,0]
["Refuse Containment",null,null,null,null,null,null,null,null,null,null,null,null,null,null,null,0]
["Safety",null,null,null,null,null,null,null,null,null,null,null,null,null,null,null,0]
[null,null,null,null,null,null,null,null,null,null,null,null,null,null,null,null,0]
[null,null,null,null,null,null,null,null,null,null,null,null,null,null,null,null,0]
[null,null,null,null,null,null,null,null,null,null,null,null,null,null,null,null,0]
[null,null,null,null,null,null,null,null,null,null,null,null,null,null,null,null,0]
[null,null,null,null,null,null,null,null,null,null,null,null,null,null,null,null,0]
[null,null,null,null,null,null,null,null,null,null,null,null,null,null,null,null,0]
[null,null,null,null,null,null,null,null,null,null,null,null,null,null,null,null,0]
[null,null,null,null,null,null,null,null,null,null,null,null,null,null,null,null,0]
[null,null,null,null,null,null,null,null,null,null,null,null,null,null,null,null,0]
[]
["Subtotal of General Conditions",null,null,null,null,null,null,null,null,null,null,null,null,null,null,null,{"$f":"SUBTOTAL(9,Q175:R187)","v":0}]
[]
[]
[]
[]
[]
[]
[]
[]
[]
["Insurance Costs will be $ per One Thousand $ ($1,000)",null,null,null,null,null,null,null,null,null,null,null,null,null,null,null,{"$f":"Q210*P198/1000","v":0},null,null,null,null,null,null,null,null,null,null,null,null,null,null,null,null,null,null,null,null,null,null,null,null,null,null,null,null,null,null,null,null,"*"]
["Subtotal",null,null,null,null,null,null,null,null,null,null,null,null,null,null,{"$f":"Q198+Q210","v":0}]
["Performance and Payment Bond Cost will be $ per One Thousand $ ($1,000)",null,null,null,null,null,null,null,"First ",2500000,null,"Balance",null,null,null,null,{"$f":"IF(P199>J200,(((K200*J200)/1000))+(((P199-J200)*N200)/1000),(P199*K200)/1000)","v":0}]
["Subtotal",null,null,null,null,null,null,null,null,null,null,null,null,null,null,{"$f":"Q200+P199","v":0}]
["Total General Conditions Costs",null,null,null,null,null,null,null,null,null,null,null,null,null,null,null,{"$f":"Q188+Q198+Q200","v":0}]
[]
["C.1 Trades",null,null,null,null,null,null,null,null,null,null,null,null,null,null,null,{"$f":"Q162","v":0}]
["C.2 Subtotal General Conditions (excludes insurance and bonds)",null,null,null,null,null,null,null,null,null,null,null,null,null,null,null,{"$f":"Q188","v":0}]
["C.3.1 Pre-Construction",null,null,null,null,null,null,null,null,null,null,null,null,null,null,null,{"$f":"O226","v":0}]
["C.3.2 Construction",null,null,null,null,null,null,null,null,null,null,null,null,null,null,null,{"$f":"O250","v":0}]
["C.4.1 Pre-Construction Fee",null,null,null,null,null,null,null,null,null,null,null,null,null,null,null,{"$f":"Q274","v":0}]
["C.4.2 Construction Fee",null,null,null,null,null,null,null,null,null,null,null,null,null,null,null,{"$f":"Q283","v":0}]
["Subtotal ",null,null,null,null,null,null,null,null,null,null,null,null,null,null,null,{"$f":"SUM(Q204:R209)+Q271","v":0}]
[]
["C.3 Construction Manager Personnel Costs"]
[]
["Pre-Construction"]
[]
["Title/Name",null,null,null,null,null,null,"Hourly Rate",null,null,null,"Total Hours",null,null,"Extended Amount",null,null,null,null,null,null,null,null,null,null,null,null,null,null,null,null,null,null,null,null,null,null,null,null,null,null,null,null,null,null,null,null,null,null,"*"]
[]
[null,null,null,null,null,null,null,0,null,null,null,0,null,null,{"$f":"H218*L218","v":0}]
[null,null,null,null,null,null,null,0,null,null,null,0,null,null,0]
[null,null,null,null,null,null,null,0,null,null,null,0,null,null,0]
[null,null,null,null,null,null,null,0,null,null,null,0,null,null,0]
[null,null,null,null,null,null,null,0,null,null,null,0,null,null,0]
[null,null,null,null,null,null,null,0,null,null,null,0,null,null,0]
[null,null,null,null,null,null,null,0,null,null,null,0,null,null,{"$f":"H224*L224","v":0}]
[]
["Subtotal",null,null,null,null,null,null,null,null,null,null,null,null,null,{"$f":"SUBTOTAL(9,O218:P225)","v":0}]
[]
[]
[]
[]
[]
[]
[]
[]
[]
[]
[]
["Construction"]
[]
["Title/Name",null,null,null,null,null,null,"Hourly Rate",null,null,null,"Total Hours",null,null,"Extended Amount",null,null,null,null,null,null,null,null,null,null,null,null,null,null,null,null,null,null,null,null,null,null,null,null,null,null,null,null,null,null,null,null,null,null,"*"]
[]
[null,null,null,null,null,null,null,0,null,null,null,null,null,null,{"$f":"H242*L242","v":0}]
[null,null,null,null,null,null,null,0,null,null,null,0,null,null,0]
[null,null,null,null,null,null,null,0,null,null,null,0,null,null,0]
[null,null,null,null,null,null,null,0,null,null,null,0,null,null,0]
[null,null,null,null,null,null,null,0,null,null,null,0,null,null,0]
[null,null,null,null,null,null,null,0,null,null,null,0,null,null,0]
[null,null,null,null,null,null,null,0,null,null,null,0,null,null,0]
[]
["Subtotal",null,null,null,null,null,null,null,null,null,null,null,null,null,{"$f":"SUBTOTAL(9,O242:P249)","v":0}]
["Total Pre-Construction and Construction Personnel Costs",null,null,null,null,null,null,null,null,null,null,"Lump Sum",null,null,{"$f":"O250+O226","v":0}]
[]
[]
[]
[]
[]
[]
[]
[]
[]
[]
[]
[]
[]
["C.4.CM Fee"]
["Pre-Construction - Fee is based upon",null,null,null,null,null,null,null,null,0.04,"of Total Pre-Construction Personnel Costs and Pre-Construction Reimbursable Values"]
[]
["Pre-Construction Fee",null,null,null,null,null,null,null,null,null,null,null,null,null,null,null,"Amount",null,null,null,null,null,null,null,null,null,null,null,null,null,null,null,null,null,null,null,null,null,null,null,null,null,null,null,null,null,null,null,null,"*"]
["Pre-Construction Personnel Costs from Section C.3.1 Construction Manager Personnel Costs",null,null,null,null,null,null,null,null,null,null,null,null,null,null,null,{"$f":"O226","v":0}]
["Pre-Construction Reimbursable Values",null,null,null,null,null,null,null,null,null,null,null,null,null,null,null,0]
["Pre-Purchase Equipment",null,null,null,null,null,null,null,null,null,null,null,null,null,null,null,0]
["Subtotal",null,null,null,null,null,null,null,null,null,null,null,null,null,null,null,{"$f":"Q269+Q270+Q271","v":0},null,null,null,null,null,null,null,null,null,null,null,null,null,null,null,null,null,null,null,null,null,null,null,null,null,null,null,null,null,null,null,null,"Pre-Purchase Equipment (Contractor edits)"]
["Subtotal Above Multiplied by CM Pre-Construction Fee of ",null,null,null,null,null,null,null,null,null,{"$f":"J266","v":0.04},null,null,null,null,null,{"$f":"Q272*K273","v":0}]
["Total CM Pre-Construction Fee                                                                                                                         ",null,null,null,null,null,null,null,null,null,null,null,null,null,null,"Lump Sum",{"$f":"Q273","v":0}]
[]
[]
["Construction - Fee is based upon",null,null,null,null,null,null,null,null,0.04,"of Total Trade Contractor Costs"]
[]
["Construction Fee",null,null,null,null,null,null,null,null,null,null,null,null,null,null,null,"Amount",null,null,null,null,null,null,null,null,null,null,null,null,null,null,null,null,null,null,null,null,null,null,null,null,null,null,null,null,null,null,null,null,"*"]
["Trade Contract Costs from Section C.1 Trade Contractor Bid Summary",null,null,null,null,null,null,null,null,null,null,null,null,null,null,null,{"$f":"Q162","v":0}]
["Subtotal",null,null,null,null,null,null,null,null,null,null,null,null,null,null,null,{"$f":"Q280","v":0}]
["Subtotal Above Multiplied by CM Construction Fee of ",null,null,null,null,null,null,null,null,null,{"$f":"J277","v":0.04},null,null,null,null,null,{"$f":"Q281*K282","v":0}]
["Total CM Construction Fee                                                                                                                ",null,null,null,null,null,null,null,null,null,null,null,null,null,null,"Lump Sum",{"$f":"Q282","v":0}]
[]
["Total Pre-Construction and Construction Fee",null,null,null,null,null,null,null,null,null,null,null,null,null,"Total Lump Sum",null,{"$f":"Q283+Q274","v":0}]
[]
[]
["GMP - Trades and Construction Manager Cost Summary"]
[]
["C.1 Trade Contractor Bid",null,null,null,null,null,null,null,null,null,null,null,null,null,null,null,{"$f":"Q162","v":0}]
["C.2 CM General Conditions Total",null,null,null,null,null,null,null,null,null,null,null,null,null,null,null,{"$f":"Q202","v":0}]
["C.3 Pre-Construction Total",null,null,null,null,null,null,null,null,null,null,null,null,null,null,null,{"$f":"O226","v":0}]
["C.3 Construction Personnel Costs Total",null,null,null,null,null,null,null,null,null,null,null,null,null,null,null,{"$f":"O250","v":0}]
["C.4 CM Fee Total",null,null,null,null,null,null,null,null,null,null,null,null,null,null,null,{"$f":"Q285","v":0}]
["Pre-Construction Reimbursable Values and Pre-Purchase Equipment",null,null,null,null,null,null,null,null,null,null,null,null,null,null,null,{"$f":"Q270+Q271","v":0}]
["C.5 Construction Manager Total (Sum of C.2, C.3 and C.4)",null,null,null,null,null,null,null,null,null,null,null,null,null,null,null,{"$f":"Q291+Q292+Q294+Q295+Q293","v":0}]
["Combined Trade Contractor Bid Summary and Construction Manager Costs: "]
["Guaranteed Maximum Price (Sum of C.1, C.5 and Pre-Construction Reimbursable Values and Pre-Purchase Equipment )",null,null,null,null,null,null,null,null,null,null,null,null,null,"Grand Total Lump Sum",null,{"$f":"Q290+Q296","v":0}]
[]
[]
[]
[]
[]
[]
[]
[]
[]
[]
[]
[]
[]
[]
[]
[]
[]
[]
[]
[]
[]
[]
[]
[]
[]
[]
[]
[]
[]
[]
[]
[]
[]
[]
[]
[]
[]
[]
[]
[]
[]
[]
[]
[]
[]
[]
[]
[]
[]
[]
[]
[]
[]
[]
[]
[]
[]
[]
[]
[]
[]
[]
[]
[]
[]
[]
[]
[]
[]
[]
[]
[]
[]
[]
[]
[]
[]
[]
[]
[]
[]
[]
[]
[]
[]
[]
[]
[]
[]
[]
[]
[]
[]
[]
[]
[]
[]
[]
[]
[]
[]
[]
[]
[]
[]
[]
[]
[]
[]
[]
[]
[]
[]
[]
[]
[]
[]
[]
[]
[]
[]
[]
[]
[]
[]
[]
[]
[]
[]
[]
[]
[]
[]
[]
[]
[]
[]
[]
[]
[]
[]
[]
[]
[]
[]
[]
[]
[]
[]
[]
[]
[]
[]
[]
[]
[]
[]
[]
[]
[]
[]
[]
[]
[]
[]
[]
[]
[]
[]
[]
[]
[]
[]
[]
[]
[]
[]
[]
[]
[]
[]
[]
[]
[]
[]
[]
[]
[]
[]
[]
[]
[]
[]
[]
[]
[]
[]
[]
[]
[]
[]
[]
[]
[]
[null,null,null,null,null,null,null,null,null,null,null,null,null,null,null,null,0]
[null,null,null,null,null,null,null,0,null,null,null,0,null,null,{"$f":"H504*L504","v":0}]
[null,null,null,null,null,null,null,0,null,null,null,0,null,null,{"$f":"H505*L505","v":0}]

{"sheet":"GMP Trade Contractor Bid - FLCC","index":6,"n_rows":505,"n_cols":51,"rows_kept":505,"cut":false,"hidden":true,"merged":[[293,0,293,15],[293,16,293,17],[289,0,289,15],[289,16,289,17],[290,0,290,15],[290,16,290,17],[291,0,291,15],[291,16,291,17],[504,0,504,6],[504,7,504,10],[504,11,504,13],[504,14,504,15],[297,0,297,13],[297,14,297,15],[297,16,297,17],[502,0,502,15],[502,16,502,17],[503,0,503,6],[503,7,503,10],[503,11,503,13],[503,14,503,15],[294,16,294,17],[295,16,295,17],[292,0,292,15],[281,0,281,7],[281,10,281,15],[281,16,281,17],[282,0,282,14],[282,16,282,17],[284,14,284,15],[284,16,284,17],[274,18,274,19],[278,0,278,15],[278,16,278,17],[279,0,279,15],[279,16,279,17],[280,0,280,15],[280,16,280,17],[272,0,272,7],[272,10,272,15],[272,16,272,17],[272,18,272,19],[273,0,273,14],[273,16,273,17],[273,18,273,19],[269,0,269,15],[269,16,269,17],[269,18,269,19],[270,16,270,17],[271,0,271,15],[271,16,271,17],[271,18,271,19],[265,18,265,19],[266,18,266,19],[267,0,267,15],[267,16,267,17],[267,18,267,19],[268,0,268,15],[268,16,268,17],[268,18,268,19],[248,18,248,19],[249,0,249,6],[249,7,249,10],[249,11,249,13],[249,14,249,15],[250,0,250,10],[250,11,250,13],[250,14,250,15],[246,0,246,6],[246,7,246,10],[246,11,246,13],[246,14,246,15],[247,0,247,6],[247,7,247,10],[247,11,247,13],[247,14,247,15],[244,0,244,6],[244,7,244,10],[244,11,244,13],[244,14,244,15],[245,0,245,6],[245,7,245,10],[245,11,245,13],[245,14,245,15],[242,0,242,6],[242,7,242,10],[242,11,242,13],[242,14,242,15],[243,0,243,6],[243,7,243,10],[243,11,243,13],[243,14,243,15],[239,0,240,6],[239,7,240,10],[239,11,240,13],[239,14,240,15],[241,0,241,6],[241,7,241,10],[241,11,241,13],[241,14,241,15],[223,0,223,6],[223,7,223,10],[223,11,223,13],[223,14,223,15],[225,0,225,6],[225,7,225,10],[225,11,225,13],[225,14,225,15],[221,0,221,6],[221,7,221,10],[221,11,221,13],[221,14,221,15],[222,0,222,6],[222,7,222,10],[222,11,222,13],[222,14,222,15],[219,0,219,6],[219,7,219,10],[219,11,219,13],[219,14,219,15],[220,0,220,6],[220,7,220,10],[220,11,220,13],[220,14,220,15],[217,0,217,6],[217,7,217,10],[217,11,217,13],[217,14,217,15],[218,0,218,6],[218,7,218,10],[218,11,218,13],[218,14,218,15],[208,0,208,15],[208,16,208,17],[209,0,209,15],[209,16,209,17],[215,0,216,6],[215,7,216,10],[215,11,216,13],[215,14,216,15],[205,0,205,15],[205,16,205,17],[206,0,206,15],[206,16,206,17],[207,0,207,15],[207,16,207,17],[202,0,202,15],[202,16,202,17],[203,0,203,15],[203,16,203,17],[204,0,204,15],[204,16,204,17],[199,16,199,17],[200,0,200,14],[200,16,200,17],[201,0,201,15],[201,16,201,17],[199,11,199,12],[199,13,199,14],[187,0,187,15],[187,16,187,17],[197,0,197,14],[197,16,197,17],[198,0,198,14],[198,16,198,17],[183,0,183,15],[183,16,183,17],[184,0,184,15],[184,16,184,17],[185,0,185,15],[185,16,185,17],[180,0,180,15],[180,16,180,17],[181,0,181,15],[181,16,181,17],[182,0,182,15],[182,16,182,17],[178,0,178,15],[178,16,178,17],[178,20,178,21],[178,22,178,23],[179,0,179,15],[179,16,179,17],[179,20,179,21],[179,22,179,23],[176,0,176,15],[176,16,176,17],[176,20,176,21],[176,22,176,23],[177,0,177,15],[177,16,177,17],[177,20,177,21],[177,22,177,23],[174,0,174,15],[174,16,174,17],[174,20,174,21],[174,22,174,23],[175,0,175,15],[175,16,175,17],[175,20,175,21],[175,22,175,23],[170,20,170,21],[170,22,170,23],[171,20,171,21],[171,22,171,23],[172,0,173,15],[172,16,173,17],[172,20,172,21],[172,22,172,23],[173,20,173,21],[173,22,173,23],[158,0,158,1],[158,2,158,3],[158,4,158,7],[159,16,159,17],[161,16,161,17],[164,0,169,19],[156,0,156,1],[156,2,156,3],[156,4,156,7],[157,0,157,1],[157,2,157,3],[157,4,157,7],[147,8,158,14],[147,16,158,17],[154,0,154,1],[154,2,154,3],[154,4,154,7],[155,0,155,1],[155,2,155,3],[155,4,155,7],[152,0,152,1],[152,2,152,3],[152,4,152,7],[153,0,153,1],[153,2,153,3],[153,4,153,7],[149,4,149,7],[150,0,150,1],[150,2,150,3],[150,4,150,7],[151,0,151,1],[151,2,151,3],[151,4,151,7],[147,0,147,1],[147,2,147,3],[147,4,147,7],[148,0,148,1],[148,2,148,3],[148,4,148,7],[149,0,149,1],[149,2,149,3],[140,2,140,3],[140,6,140,7],[141,0,141,15],[141,16,141,17],[143,16,143,17],[146,0,146,1],[146,2,146,3],[146,12,146,13],[137,0,140,1],[137,2,137,3],[137,6,137,7],[137,10,140,11],[137,12,140,13],[137,16,140,17],[138,2,138,3],[138,6,138,7],[139,2,139,3],[139,6,139,7],[136,16,136,17],[113,11,113,14],[113,16,113,17],[132,0,135,1],[132,2,132,3],[132,6,132,7],[132,10,135,11],[132,12,135,13],[132,16,135,17],[133,2,133,3],[133,6,133,7],[131,16,131,17],[102,2,102,3],[102,6,102,7],[102,10,105,11],[102,12,105,13],[134,2,134,3],[134,6,134,7],[135,2,135,3],[135,6,135,7],[136,0,136,15],[109,2,109,3],[109,6,109,7],[110,2,110,3],[110,6,110,7],[111,0,111,15],[131,0,131,1],[131,2,131,3],[131,6,131,7],[131,8,131,9],[131,10,131,11],[131,12,131,13],[131,14,131,15],[111,16,111,17],[106,0,106,15],[106,16,106,17],[107,0,110,1],[107,2,107,3],[107,6,107,7],[107,10,110,11],[107,12,110,13],[107,16,110,17],[108,2,108,3],[108,6,108,7],[87,10,90,11],[87,12,90,13],[102,16,105,17],[97,0,100,1],[97,2,97,3],[97,6,97,7],[97,10,100,11],[97,12,100,13],[97,16,100,17],[98,2,98,3],[98,6,98,7],[99,2,99,3],[99,6,99,7],[103,2,103,3],[103,6,103,7],[104,2,104,3],[104,6,104,7],[105,2,105,3],[105,6,105,7],[100,2,100,3],[100,6,100,7],[101,0,101,15],[101,16,101,17],[102,0,105,1],[94,2,94,3],[94,6,94,7],[95,2,95,3],[95,6,95,7],[96,0,96,15],[96,16,96,17],[91,0,91,15],[91,16,91,17],[92,0,95,1],[92,2,92,3],[92,6,92,7],[92,10,95,11],[92,12,95,13],[92,16,95,17],[93,2,93,3],[93,6,93,7],[87,16,90,17],[82,0,85,1],[82,2,82,3],[82,6,82,7],[82,10,85,11],[82,12,85,13],[82,16,85,17],[83,2,83,3],[83,6,83,7],[84,2,84,3],[84,6,84,7],[88,2,88,3],[88,6,88,7],[89,2,89,3],[89,6,89,7],[90,2,90,3],[90,6,90,7],[85,2,85,3],[85,6,85,7],[86,0,86,15],[86,16,86,17],[87,0,90,1],[87,2,87,3],[87,6,87,7],[70,6,70,7],[71,0,71,15],[79,2,79,3],[79,6,79,7],[80,2,80,3],[80,6,80,7],[81,0,81,15],[81,16,81,17],[76,0,76,15],[76,16,76,17],[77,0,80,1],[77,2,77,3],[77,6,77,7],[77,10,80,11],[77,12,80,13],[77,16,80,17],[78,2,78,3],[78,6,78,7],[71,16,71,17],[72,0,75,1],[72,2,72,3],[72,6,72,7],[72,10,75,11],[72,12,75,13],[56,16,56,17],[57,0,60,1],[57,2,57,3],[57,6,57,7],[57,10,60,11],[57,12,60,13],[72,16,75,17],[67,0,70,1],[67,2,67,3],[67,6,67,7],[67,10,70,11],[67,12,70,13],[67,16,70,17],[68,2,68,3],[68,6,68,7],[69,2,69,3],[69,6,69,7],[73,2,73,3],[73,6,73,7],[74,2,74,3],[74,6,74,7],[75,2,75,3],[75,6,75,7],[70,2,70,3],[64,2,64,3],[64,6,64,7],[65,2,65,3],[65,6,65,7],[66,0,66,15],[66,16,66,17],[61,0,61,15],[61,16,61,17],[62,0,65,1],[62,2,62,3],[62,6,62,7],[62,10,65,11],[62,12,65,13],[62,16,65,17],[63,2,63,3],[63,6,63,7],[42,2,42,3],[42,6,42,7],[42,10,45,11],[42,12,45,13],[57,16,60,17],[52,0,55,1],[52,2,52,3],[52,6,52,7],[52,10,55,11],[52,12,55,13],[52,16,55,17],[53,2,53,3],[53,6,53,7],[54,2,54,3],[54,6,54,7],[58,2,58,3],[58,6,58,7],[59,2,59,3],[59,6,59,7],[60,2,60,3],[60,6,60,7],[55,2,55,3],[55,6,55,7],[56,0,56,15],[49,2,49,3],[49,6,49,7],[50,2,50,3],[50,6,50,7],[51,0,51,15],[51,16,51,17],[46,0,46,15],[46,16,46,17],[47,0,50,1],[47,2,47,3],[47,6,47,7],[47,10,50,11],[47,12,50,13],[47,16,50,17],[48,2,48,3],[48,6,48,7],[27,10,30,11],[27,12,30,13],[42,16,45,17],[37,0,40,1],[37,2,37,3],[37,6,37,7],[37,10,40,11],[37,12,40,13],[37,16,40,17],[38,2,38,3],[38,6,38,7],[39,2,39,3],[39,6,39,7],[43,2,43,3],[43,6,43,7],[44,2,44,3],[44,6,44,7],[45,2,45,3],[45,6,45,7],[40,2,40,3],[40,6,40,7],[41,0,41,15],[41,16,41,17],[42,0,45,1],[34,2,34,3],[34,6,34,7],[35,2,35,3],[35,6,35,7],[36,0,36,15],[36,16,36,17],[31,0,31,15],[31,16,31,17],[32,0,35,1],[32,2,32,3],[32,6,32,7],[32,10,35,11],[32,12,35,13],[32,16,35,17],[33,2,33,3],[33,6,33,7],[27,16,30,17],[22,0,25,1],[22,2,22,3],[22,6,22,7],[22,10,25,11],[22,12,25,13],[22,16,25,17],[23,2,23,3],[23,6,23,7],[24,2,24,3],[24,6,24,7],[28,2,28,3],[28,6,28,7],[29,2,29,3],[29,6,29,7],[30,2,30,3],[30,6,30,7],[25,2,25,3],[25,6,25,7],[26,0,26,15],[26,16,26,17],[27,0,30,1],[27,2,27,3],[27,6,27,7],[19,2,19,3],[19,6,19,7],[20,2,20,3],[20,6,20,7],[21,0,21,15],[21,16,21,17],[16,0,16,15],[16,16,16,17],[17,0,20,1],[17,2,17,3],[17,6,17,7],[17,10,20,11],[17,12,20,13],[17,16,20,17],[18,2,18,3],[18,6,18,7],[10,6,10,7],[11,0,11,15],[11,16,11,17],[12,0,15,1],[12,2,12,3],[12,6,12,7],[12,10,15,11],[12,12,15,13],[7,0,10,1],[7,2,7,3],[7,6,7,7],[7,10,10,11],[7,12,10,13],[7,16,10,17],[8,2,8,3],[292,16,292,17],[8,6,8,7],[9,2,9,3],[0,0,1,17],[4,0,6,1],[4,2,6,3],[4,4,6,4],[4,5,6,5],[4,6,6,7],[4,8,6,9],[4,10,6,11],[4,12,6,13],[4,14,6,15],[4,16,6,17],[2,16,2,17],[12,16,15,17],[13,2,13,3],[13,6,13,7],[14,2,14,3],[14,6,14,7],[15,2,15,3],[15,6,15,7],[9,6,9,7],[10,2,10,3]]}
["Trade Contractor Bid Summary - All proposals received from the Trade Contractors must follow this document in the same sequential order as noted on the following including any and all bid declinations.",null,null,null,null,null,null,null,null,null,null,null,null,null,null,null,null,null,"False",null,null,null,null,null,null,null,null,null,null,null,null,null,null,null,null,null,null,null,null,null,null,null,null,null,null,null,"Decline Bid"]
[null,null,null,null,null,null,null,null,null,null,null,null,null,null,null,null,null,null,null,null,null,null,null,null,null,null,null,null,null,null,null,null,null,null,null,null,null,null,null,null,null,null,null,null,null,null,"No Response"]
[null,null,null,null,null,null,null,null,null,null,null,null," = to be completed by Construction Manager",null,null,null,{"$f":"'FLCC Instructions'!P1","v":"Rev. 6/14/24"}]
[null,null,null,null,null,null,null,null,null,null,null,null," = predetermined or automatic calculation"]
["Scope/Trade\n(Includes CSI #'s for clarity)",null,"Proposed Trade Contractor/Self Perform",null,"Self Perform","Decline Bid or No Response","Proposed Amounts \n(low to high)",null,"No Estimates at GMP",null,"Selected Firm",null,"EMR",null,"Intended Awardee Proposal Detail  & (accepted alternates only)",null,"Total",null,null,true]
[]
[null,null,null,null,false,null,null,null,null,null,null,null,null,null,null,null,null,null,null,null,null,null,null,null,null,null,null,null,null,null,null,null,null,null,null,null,null,null,null,null,null,null,null,null,null,null,null,null,null,"*"]
[{"$f":"'FLCC CSI Cost Estimate Summary'!A8:B11","v":0},null,{"$f":"'FLCC CSI Cost Estimate Summary'!C8:D8","v":"Name"},null,{"$f":"'FLCC CSI Cost Estimate Summary'!E8","v":false},{"$f":"'FLCC CSI Cost Estimate Summary'!F8","v":0},{"$f":"'FLCC CSI Cost Estimate Summary'!G8:H8","v":0},null,true,{"$f":"'FLCC CSI Cost Estimate Summary'!$J8","v":false},{"$f":"C8","v":"Name"},null,{"$f":"'FLCC CSI Cost Estimate Summary'!M8:N11","v":0},null,"Base Bid",{"$f":"'FLCC CSI Cost Estimate Summary'!P8","v":0},{"$f":"IF(S8=$S$1,SUM(P8:P11),0)","v":0},null,{"$f":"IF(E8,\"True\",\"False\")","v":"False"},{"$f":"IF($S8=\"true\",A8,\"\")","v":""},{"$f":"IF($S8=\"true\",C8,\"\")","v":""},{"$f":"IF($S8=\"true\",E8,\"\")","v":""},{"$f":"IF($S8=\"true\",\"A\",\"\")","v":""},{"$f":"IF($S8=\"true\",\"A\",\"\")","v":""},{"$f":"IF($S8=\"true\",G8,\"\")","v":""},{"$f":"IF($S8=\"true\",\"A\",\"\")","v":""},{"$f":"IF($S8=\"true\",\"A\",\"\")","v":""},{"$f":"IF($S8=\"true\",\"A\",\"\")","v":""},{"$f":"IF($S8=\"true\",K8,\"\")","v":""},{"$f":"IF($S8=\"true\",M8,\"\")","v":""},{"$f":"IF($S8=\"true\",P8,\"\")","v":""},{"$f":"IF($S8=\"true\",P9,\"\")","v":""},{"$f":"IF($S8=\"true\",P10,\"\")","v":""},{"$f":"IF($S8=\"true\",P11,\"\")","v":""},{"$f":"IF($S8=\"true\",#REF!,\"\")","v":""},{"$f":"IF($S8=\"true\",SUM(P8:P11),\"\")","v":""}]
[null,null,{"$f":"'FLCC CSI Cost Estimate Summary'!C9:D9","v":"Name"},null,false,{"$f":"'FLCC CSI Cost Estimate Summary'!F9","v":0},{"$f":"'FLCC CSI Cost Estimate Summary'!G9:H9","v":0},null,{"$f":"'FLCC CSI Cost Estimate Summary'!$J9","v":0},{"$f":"'FLCC CSI Cost Estimate Summary'!$J9","v":0},null,null,null,null,"Alternate",{"$f":"'FLCC CSI Cost Estimate Summary'!P9","v":0},null,null,{"$f":"IF(E9,\"True\",\"False\")","v":"False"},{"$f":"IF($S9=\"true\",A9,\"\")","v":""},{"$f":"IF($S9=\"true\",C9,\"\")","v":""},{"$f":"IF($S9=\"true\",E9,\"\")","v":""},{"$f":"IF($S9=\"true\",\"A\",\"\")","v":""},"",{"$f":"IF($S9=\"true\",G9,\"\")","v":""},{"$f":"IF($S9=\"true\",\"A\",\"\")","v":""},"","",{"$f":"IF($S9=\"true\",K9,\"\")","v":""},"","","","","",{"$f":"IF($S9=\"true\",#REF!,\"\")","v":""},{"$f":"IF($S9=\"true\",SUM(P9:P12),\"\")","v":""}]
[null,null,{"$f":"'FLCC CSI Cost Estimate Summary'!C10:D10","v":"Name"},null,{"$f":"'FLCC CSI Cost Estimate Summary'!E10","v":false},{"$f":"'FLCC CSI Cost Estimate Summary'!F10","v":0},{"$f":"'FLCC CSI Cost Estimate Summary'!G10:H10","v":0},null,{"$f":"'FLCC CSI Cost Estimate Summary'!$J10","v":0},{"$f":"'FLCC CSI Cost Estimate Summary'!$J10","v":0},null,null,null,null,"Alternate",{"$f":"'FLCC CSI Cost Estimate Summary'!P10","v":0},null,null,"False","","","","","","","","","","","","","","","",{"$f":"IF($S10=\"true\",#REF!,\"\")","v":""},""]
[null,null,{"$f":"'FLCC CSI Cost Estimate Summary'!C11:D11","v":"Name"},null,{"$f":"'FLCC CSI Cost Estimate Summary'!E11","v":false},{"$f":"'FLCC CSI Cost Estimate Summary'!F11","v":0},{"$f":"'FLCC CSI Cost Estimate Summary'!G11:H11","v":0},null,{"$f":"'FLCC CSI Cost Estimate Summary'!$J11","v":0},{"$f":"'FLCC CSI Cost Estimate Summary'!$J11","v":0},null,null,null,null,"Alternate",{"$f":"'FLCC CSI Cost Estimate Summary'!P11","v":0},null,null,"False","","","","","","","","","","","","","","","",{"$f":"IF($S11=\"true\",#REF!,\"\")","v":""},""]
[{"$f":"'FLCC CSI Cost Estimate Summary'!A12:P12","v":"Contractor Scope/Trade Detail:"},null,null,null,null,null,null,null,null,null,null,null,null,null,null,null,"AEC PM Approval:",null,"False","","","","","","","","","","","","","","","",{"$f":"IF($S12=\"true\",#REF!,\"\")","v":""},""]
[{"$f":"'FLCC CSI Cost Estimate Summary'!A13:B16","v":0},null,{"$f":"'FLCC CSI Cost Estimate Summary'!C13:D13","v":"Name"},null,{"$f":"'FLCC CSI Cost Estimate Summary'!E13","v":false},{"$f":"'FLCC CSI Cost Estimate Summary'!F13","v":0},{"$f":"'FLCC CSI Cost Estimate Summary'!G13:H13","v":0},null,{"$f":"'FLCC CSI Cost Estimate Summary'!J13","v":false},{"$f":"'FLCC CSI Cost Estimate Summary'!$J13","v":false},{"$f":"C13","v":"Name"},null,{"$f":"'FLCC CSI Cost Estimate Summary'!M13:N16","v":0},null,"Base Bid",{"$f":"'FLCC CSI Cost Estimate Summary'!P13","v":0},{"$f":"IF(S13=$S$1,SUM(P13:P16),0)","v":0},null,"False","","","","","","","","","","","","","","","",{"$f":"IF($S13=\"true\",#REF!,\"\")","v":""},""]
[null,null,{"$f":"'FLCC CSI Cost Estimate Summary'!C14:D14","v":"Name"},null,{"$f":"'FLCC CSI Cost Estimate Summary'!E14","v":false},{"$f":"'FLCC CSI Cost Estimate Summary'!F14","v":0},{"$f":"'FLCC CSI Cost Estimate Summary'!G14:H14","v":0},null,{"$f":"'FLCC CSI Cost Estimate Summary'!J14","v":0},{"$f":"'FLCC CSI Cost Estimate Summary'!$J14","v":0},null,null,null,null,"Alternate",{"$f":"'FLCC CSI Cost Estimate Summary'!P14","v":0},null,null,"False","","","","","","","","","","","","","","","",{"$f":"IF($S14=\"true\",#REF!,\"\")","v":""},""]
[null,null,{"$f":"'FLCC CSI Cost Estimate Summary'!C15:D15","v":"Name"},null,{"$f":"'FLCC CSI Cost Estimate Summary'!E15","v":false},{"$f":"'FLCC CSI Cost Estimate Summary'!F15","v":0},{"$f":"'FLCC CSI Cost Estimate Summary'!G15:H15","v":0},null,{"$f":"'FLCC CSI Cost Estimate Summary'!J15","v":0},{"$f":"'FLCC CSI Cost Estimate Summary'!$J15","v":0},null,null,null,null,"Alternate",{"$f":"'FLCC CSI Cost Estimate Summary'!P15","v":0},null,null,"False","","","","","","","","","","","","","","","",{"$f":"IF($S15=\"true\",#REF!,\"\")","v":""},""]
[null,null,{"$f":"'FLCC CSI Cost Estimate Summary'!C16:D16","v":"Name"},null,{"$f":"'FLCC CSI Cost Estimate Summary'!E16","v":false},{"$f":"'FLCC CSI Cost Estimate Summary'!F16","v":0},{"$f":"'FLCC CSI Cost Estimate Summary'!G16:H16","v":0},null,{"$f":"'FLCC CSI Cost Estimate Summary'!J16","v":0},{"$f":"'FLCC CSI Cost Estimate Summary'!$J16","v":0},null,null,null,null,"Alternate",{"$f":"'FLCC CSI Cost Estimate Summary'!P16","v":0},null,null,"False","","","","","","","","","","","","","","","",{"$f":"IF($S16=\"true\",#REF!,\"\")","v":""},""]
[{"$f":"'FLCC CSI Cost Estimate Summary'!A17:P17","v":"Contractor Scope/Trade Detail:"},null,null,null,null,null,null,null,null,null,null,null,null,null,null,null,"AEC PM Approval:",null,"False","","","","","","","","","","","","","","","",{"$f":"IF($S17=\"true\",#REF!,\"\")","v":""},""]
[{"$f":"'FLCC CSI Cost Estimate Summary'!A18:B21","v":0},null,{"$f":"'FLCC CSI Cost Estimate Summary'!C18:D18","v":"Name"},null,{"$f":"'FLCC CSI Cost Estimate Summary'!E18","v":false},{"$f":"'FLCC CSI Cost Estimate Summary'!F18","v":0},{"$f":"'FLCC CSI Cost Estimate Summary'!G18:H18","v":0},null,{"$f":"'FLCC CSI Cost Estimate Summary'!J18","v":false},{"$f":"'FLCC CSI Cost Estimate Summary'!$J18","v":false},{"$f":"C18","v":"Name"},null,{"$f":"'FLCC CSI Cost Estimate Summary'!M18:N21","v":0},null,"Base Bid",{"$f":"'FLCC CSI Cost Estimate Summary'!P18","v":0},{"$f":"IF(S18=$S$1,SUM(P18:P21),0)","v":0},null,"False","","","","","","","","","","","","","","","",{"$f":"IF($S18=\"true\",#REF!,\"\")","v":""},""]
[null,null,{"$f":"'FLCC CSI Cost Estimate Summary'!C19:D19","v":"Name"},null,{"$f":"'FLCC CSI Cost Estimate Summary'!E19","v":false},{"$f":"'FLCC CSI Cost Estimate Summary'!F19","v":0},{"$f":"'FLCC CSI Cost Estimate Summary'!G19:H19","v":0},null,{"$f":"'FLCC CSI Cost Estimate Summary'!J19","v":false},{"$f":"'FLCC CSI Cost Estimate Summary'!$J19","v":false},null,null,null,null,"Alternate",{"$f":"'FLCC CSI Cost Estimate Summary'!P19","v":0},null,null,"False","","","","","","","","","","","","","","","",{"$f":"IF($S19=\"true\",#REF!,\"\")","v":""},""]
[null,null,{"$f":"'FLCC CSI Cost Estimate Summary'!C20:D20","v":"Name"},null,{"$f":"'FLCC CSI Cost Estimate Summary'!E20","v":false},{"$f":"'FLCC CSI Cost Estimate Summary'!F20","v":0},{"$f":"'FLCC CSI Cost Estimate Summary'!G20:H20","v":0},null,{"$f":"'FLCC CSI Cost Estimate Summary'!J20","v":false},{"$f":"'FLCC CSI Cost Estimate Summary'!$J20","v":false},null,null,null,null,"Alternate",{"$f":"'FLCC CSI Cost Estimate Summary'!P20","v":0},null,null,"False","","","","","","","","","","","","","","","",{"$f":"IF($S20=\"true\",#REF!,\"\")","v":""},""]
[null,null,{"$f":"'FLCC CSI Cost Estimate Summary'!C21:D21","v":"Name"},null,{"$f":"'FLCC CSI Cost Estimate Summary'!E21","v":false},{"$f":"'FLCC CSI Cost Estimate Summary'!F21","v":0},{"$f":"'FLCC CSI Cost Estimate Summary'!G21:H21","v":0},null,{"$f":"'FLCC CSI Cost Estimate Summary'!J21","v":false},{"$f":"'FLCC CSI Cost Estimate Summary'!$J21","v":false},null,null,null,null,"Alternate",{"$f":"'FLCC CSI Cost Estimate Summary'!P21","v":0},null,null,"False","","","","","","","","","","","","","","","",{"$f":"IF($S21=\"true\",#REF!,\"\")","v":""},""]
[{"$f":"'FLCC CSI Cost Estimate Summary'!A22:P22","v":"Contractor Scope/Trade Detail:"},null,null,null,null,null,null,null,null,null,null,null,null,null,null,null,"AEC PM Approval:",null,"False","","","","","","","","","","","","","","","",{"$f":"IF($S22=\"true\",#REF!,\"\")","v":""},""]
[{"$f":"'FLCC CSI Cost Estimate Summary'!A23:B26","v":0},null,{"$f":"'FLCC CSI Cost Estimate Summary'!C23:D23","v":"Name"},null,{"$f":"'FLCC CSI Cost Estimate Summary'!E23","v":false},{"$f":"'FLCC CSI Cost Estimate Summary'!F23","v":0},{"$f":"'FLCC CSI Cost Estimate Summary'!G23:H23","v":0},null,{"$f":"'FLCC CSI Cost Estimate Summary'!J23","v":false},{"$f":"'FLCC CSI Cost Estimate Summary'!$J23","v":false},{"$f":"C23","v":"Name"},null,{"$f":"'FLCC CSI Cost Estimate Summary'!M23:N26","v":0},null,"Base Bid",{"$f":"'FLCC CSI Cost Estimate Summary'!P23","v":0},{"$f":"IF(S23=$S$1,SUM(P23:P26),0)","v":0},null,"False","","","","","","","","","","","","","","","",{"$f":"IF($S23=\"true\",#REF!,\"\")","v":""},""]
[null,null,{"$f":"'FLCC CSI Cost Estimate Summary'!C24:D24","v":"Name"},null,{"$f":"'FLCC CSI Cost Estimate Summary'!E24","v":false},{"$f":"'FLCC CSI Cost Estimate Summary'!F24","v":0},{"$f":"'FLCC CSI Cost Estimate Summary'!G24:H24","v":0},null,{"$f":"'FLCC CSI Cost Estimate Summary'!J24","v":0},{"$f":"'FLCC CSI Cost Estimate Summary'!$J24","v":0},null,null,null,null,"Alternate",{"$f":"'FLCC CSI Cost Estimate Summary'!P24","v":0},null,null,"False","","","","","","","","","","","","","","","",{"$f":"IF($S24=\"true\",#REF!,\"\")","v":""},""]
[null,null,{"$f":"'FLCC CSI Cost Estimate Summary'!C25:D25","v":"Name"},null,{"$f":"'FLCC CSI Cost Estimate Summary'!E25","v":false},{"$f":"'FLCC CSI Cost Estimate Summary'!F25","v":0},{"$f":"'FLCC CSI Cost Estimate Summary'!G25:H25","v":0},null,{"$f":"'FLCC CSI Cost Estimate Summary'!J25","v":0},{"$f":"'FLCC CSI Cost Estimate Summary'!$J25","v":0},null,null,null,null,"Alternate",{"$f":"'FLCC CSI Cost Estimate Summary'!P25","v":0},null,null,"False","","","","","","","","","","","","","","","",{"$f":"IF($S25=\"true\",#REF!,\"\")","v":""},""]
[null,null,{"$f":"'FLCC CSI Cost Estimate Summary'!C26:D26","v":"Name"},null,{"$f":"'FLCC CSI Cost Estimate Summary'!E26","v":false},{"$f":"'FLCC CSI Cost Estimate Summary'!F26","v":0},{"$f":"'FLCC CSI Cost Estimate Summary'!G26:H26","v":0},null,{"$f":"'FLCC CSI Cost Estimate Summary'!J26","v":0},{"$f":"'FLCC CSI Cost Estimate Summary'!$J26","v":0},null,null,null,null,"Alternate",{"$f":"'FLCC CSI Cost Estimate Summary'!P26","v":0},null,null,"False","","","","","","","","","","","","","","","",{"$f":"IF($S26=\"true\",#REF!,\"\")","v":""},""]
[{"$f":"'FLCC CSI Cost Estimate Summary'!A27:P27","v":"Contractor Scope/Trade Detail:"},null,null,null,null,null,null,null,null,null,null,null,null,null,null,null,"AEC PM Approval:",null,"False","","","","","","","","","","","","","","","",{"$f":"IF($S27=\"true\",#REF!,\"\")","v":""},""]
[{"$f":"'FLCC CSI Cost Estimate Summary'!A28:B31","v":0},null,{"$f":"'FLCC CSI Cost Estimate Summary'!C28:D28","v":"Name"},null,{"$f":"'FLCC CSI Cost Estimate Summary'!E28","v":0},{"$f":"'FLCC CSI Cost Estimate Summary'!F28","v":0},{"$f":"'FLCC CSI Cost Estimate Summary'!G28:H28","v":0},null,{"$f":"'FLCC CSI Cost Estimate Summary'!J28","v":0},{"$f":"'FLCC CSI Cost Estimate Summary'!$J28","v":0},{"$f":"C28","v":"Name"},null,{"$f":"'FLCC CSI Cost Estimate Summary'!M28:N31","v":0},null,"Base Bid",{"$f":"'FLCC CSI Cost Estimate Summary'!P28","v":0},{"$f":"IF(S28=$S$1,SUM(P28:P31),0)","v":0},null,"False","","","","","","","","","","","","","","","",{"$f":"IF($S28=\"true\",#REF!,\"\")","v":""},""]
[null,null,{"$f":"'FLCC CSI Cost Estimate Summary'!C29:D29","v":"Name"},null,{"$f":"'FLCC CSI Cost Estimate Summary'!E29","v":false},{"$f":"'FLCC CSI Cost Estimate Summary'!F29","v":0},{"$f":"'FLCC CSI Cost Estimate Summary'!G29:H29","v":0},null,{"$f":"'FLCC CSI Cost Estimate Summary'!J29","v":0},{"$f":"'FLCC CSI Cost Estimate Summary'!$J29","v":0},null,null,null,null,"Alternate",{"$f":"'FLCC CSI Cost Estimate Summary'!P29","v":0},null,null,"False","","","","","","","","","","","","","","","",{"$f":"IF($S29=\"true\",#REF!,\"\")","v":""},""]
[null,null,{"$f":"'FLCC CSI Cost Estimate Summary'!C30:D30","v":"Name"},null,{"$f":"'FLCC CSI Cost Estimate Summary'!E30","v":false},{"$f":"'FLCC CSI Cost Estimate Summary'!F30","v":0},{"$f":"'FLCC CSI Cost Estimate Summary'!G30:H30","v":0},null,{"$f":"'FLCC CSI Cost Estimate Summary'!J30","v":0},{"$f":"'FLCC CSI Cost Estimate Summary'!$J30","v":0},null,null,null,null,"Alternate",{"$f":"'FLCC CSI Cost Estimate Summary'!P30","v":0},null,null,"False","","","","","","","","","","","","","","","",{"$f":"IF($S30=\"true\",#REF!,\"\")","v":""},""]
[null,null,{"$f":"'FLCC CSI Cost Estimate Summary'!C31:D31","v":"Name"},null,{"$f":"'FLCC CSI Cost Estimate Summary'!E31","v":false},{"$f":"'FLCC CSI Cost Estimate Summary'!F31","v":0},{"$f":"'FLCC CSI Cost Estimate Summary'!G31:H31","v":0},null,{"$f":"'FLCC CSI Cost Estimate Summary'!J31","v":0},{"$f":"'FLCC CSI Cost Estimate Summary'!$J31","v":0},null,null,null,null,"Alternate",{"$f":"'FLCC CSI Cost Estimate Summary'!P31","v":0},null,null,"False","","","","","","","","","","","","","","","",{"$f":"IF($S31=\"true\",#REF!,\"\")","v":""},""]
[{"$f":"'FLCC CSI Cost Estimate Summary'!A32:P32","v":"Contractor Scope/Trade Detail:"},null,null,null,null,null,null,null,null,null,null,null,null,null,null,null,"AEC PM Approval:",null,"False","","","","","","","","","","","","","","","",{"$f":"IF($S32=\"true\",#REF!,\"\")","v":""},""]
[{"$f":"'FLCC CSI Cost Estimate Summary'!A33:B36","v":0},null,{"$f":"'FLCC CSI Cost Estimate Summary'!C33:D33","v":"Name"},null,{"$f":"'FLCC CSI Cost Estimate Summary'!E33","v":false},{"$f":"'FLCC CSI Cost Estimate Summary'!F33","v":0},{"$f":"'FLCC CSI Cost Estimate Summary'!G33:H33","v":0},null,{"$f":"'FLCC CSI Cost Estimate Summary'!J33","v":0},{"$f":"'FLCC CSI Cost Estimate Summary'!$J33","v":0},{"$f":"C33","v":"Name"},null,{"$f":"'FLCC CSI Cost Estimate Summary'!M33:N36","v":0},null,"Base Bid",{"$f":"'FLCC CSI Cost Estimate Summary'!P33","v":0},{"$f":"IF(S33=$S$1,SUM(P33:P36),0)","v":0},null,"False","","","","","","","","","","","","","","","",{"$f":"IF($S33=\"true\",#REF!,\"\")","v":""},""]
[null,null,{"$f":"'FLCC CSI Cost Estimate Summary'!C34:D34","v":"Name"},null,{"$f":"'FLCC CSI Cost Estimate Summary'!E34","v":false},{"$f":"'FLCC CSI Cost Estimate Summary'!F34","v":0},{"$f":"'FLCC CSI Cost Estimate Summary'!G34:H34","v":0},null,{"$f":"'FLCC CSI Cost Estimate Summary'!J34","v":0},{"$f":"'FLCC CSI Cost Estimate Summary'!$J34","v":0},null,null,null,null,"Alternate",{"$f":"'FLCC CSI Cost Estimate Summary'!P34","v":0},null,null,"False","","","","","","","","","","","","","","","",{"$f":"IF($S34=\"true\",#REF!,\"\")","v":""},""]
[null,null,{"$f":"'FLCC CSI Cost Estimate Summary'!C35:D35","v":"Name"},null,{"$f":"'FLCC CSI Cost Estimate Summary'!E35","v":false},{"$f":"'FLCC CSI Cost Estimate Summary'!F35","v":0},{"$f":"'FLCC CSI Cost Estimate Summary'!G35:H35","v":0},null,{"$f":"'FLCC CSI Cost Estimate Summary'!J35","v":0},{"$f":"'FLCC CSI Cost Estimate Summary'!$J35","v":0},null,null,null,null,"Alternate",{"$f":"'FLCC CSI Cost Estimate Summary'!P35","v":0},null,null,"False","","","","","","","","","","","","","","","",{"$f":"IF($S35=\"true\",#REF!,\"\")","v":""},""]
[null,null,{"$f":"'FLCC CSI Cost Estimate Summary'!C36:D36","v":"Name"},null,{"$f":"'FLCC CSI Cost Estimate Summary'!E36","v":false},{"$f":"'FLCC CSI Cost Estimate Summary'!F36","v":0},{"$f":"'FLCC CSI Cost Estimate Summary'!G36:H36","v":0},null,{"$f":"'FLCC CSI Cost Estimate Summary'!J36","v":0},{"$f":"'FLCC CSI Cost Estimate Summary'!$J36","v":0},null,null,null,null,"Alternate",{"$f":"'FLCC CSI Cost Estimate Summary'!P36","v":0},null,null,"False","","","","","","","","","","","","","","","",{"$f":"IF($S36=\"true\",#REF!,\"\")","v":""},""]
[{"$f":"'FLCC CSI Cost Estimate Summary'!A37:P37","v":"Contractor Scope/Trade Detail:"},null,null,null,null,null,null,null,null,null,null,null,null,null,null,null,"AEC PM Approval:",null,"False","","","","","","","","","","","","","","","",{"$f":"IF($S37=\"true\",#REF!,\"\")","v":""},""]
[{"$f":"'FLCC CSI Cost Estimate Summary'!A38:B41","v":0},null,{"$f":"'FLCC CSI Cost Estimate Summary'!C38:D38","v":"Name"},null,{"$f":"'FLCC CSI Cost Estimate Summary'!E38","v":false},{"$f":"'FLCC CSI Cost Estimate Summary'!F38","v":0},{"$f":"'FLCC CSI Cost Estimate Summary'!G38:H38","v":0},null,{"$f":"'FLCC CSI Cost Estimate Summary'!J38","v":0},{"$f":"'FLCC CSI Cost Estimate Summary'!$J38","v":0},{"$f":"C38","v":"Name"},null,{"$f":"'FLCC CSI Cost Estimate Summary'!M38:N41","v":0},null,"Base Bid",{"$f":"'FLCC CSI Cost Estimate Summary'!P38","v":0},{"$f":"IF(S38=$S$1,SUM(P38:P41),0)","v":0},null,"False","","","","","","","","","","","","","","","",{"$f":"IF($S38=\"true\",#REF!,\"\")","v":""},""]
[null,null,{"$f":"'FLCC CSI Cost Estimate Summary'!C39:D39","v":"Name"},null,{"$f":"'FLCC CSI Cost Estimate Summary'!E39","v":false},{"$f":"'FLCC CSI Cost Estimate Summary'!F39","v":0},{"$f":"'FLCC CSI Cost Estimate Summary'!G39:H39","v":0},null,{"$f":"'FLCC CSI Cost Estimate Summary'!J39","v":0},{"$f":"'FLCC CSI Cost Estimate Summary'!$J39","v":0},null,null,null,null,"Alternate",{"$f":"'FLCC CSI Cost Estimate Summary'!P39","v":0},null,null,"False","","","","","","","","","","","","","","","",{"$f":"IF($S39=\"true\",#REF!,\"\")","v":""},""]
[null,null,{"$f":"'FLCC CSI Cost Estimate Summary'!C40:D40","v":"Name"},null,{"$f":"'FLCC CSI Cost Estimate Summary'!E40","v":false},{"$f":"'FLCC CSI Cost Estimate Summary'!F40","v":0},{"$f":"'FLCC CSI Cost Estimate Summary'!G40:H40","v":0},null,{"$f":"'FLCC CSI Cost Estimate Summary'!J40","v":0},{"$f":"'FLCC CSI Cost Estimate Summary'!$J40","v":0},null,null,null,null,"Alternate",{"$f":"'FLCC CSI Cost Estimate Summary'!P40","v":0},null,null,"False","","","","","","","","","","","","","","","",{"$f":"IF($S40=\"true\",#REF!,\"\")","v":""},""]
[null,null,{"$f":"'FLCC CSI Cost Estimate Summary'!C41:D41","v":"Name"},null,{"$f":"'FLCC CSI Cost Estimate Summary'!E41","v":false},{"$f":"'FLCC CSI Cost Estimate Summary'!F41","v":0},{"$f":"'FLCC CSI Cost Estimate Summary'!G41:H41","v":0},null,{"$f":"'FLCC CSI Cost Estimate Summary'!J41","v":0},{"$f":"'FLCC CSI Cost Estimate Summary'!$J41","v":0},null,null,null,null,"Alternate",{"$f":"'FLCC CSI Cost Estimate Summary'!P41","v":0},null,null,"False","","","",{"$f":"IF($S41=\"true\",\"A\",\"\")","v":""},"","",{"$f":"IF($S41=\"true\",\"A\",\"\")","v":""},"","","","","","","","",{"$f":"IF($S41=\"true\",#REF!,\"\")","v":""},""]
[{"$f":"'FLCC CSI Cost Estimate Summary'!A42:P42","v":"Contractor Scope/Trade Detail:"},null,null,null,null,null,null,null,null,null,null,null,null,null,null,null,"AEC PM Approval:",null,"False","","","","","","","","","","","","","","","",{"$f":"IF($S42=\"true\",#REF!,\"\")","v":""},""]
[{"$f":"'FLCC CSI Cost Estimate Summary'!A43:B46","v":0},null,{"$f":"'FLCC CSI Cost Estimate Summary'!C43:D43","v":"Name"},null,{"$f":"'FLCC CSI Cost Estimate Summary'!E43","v":false},{"$f":"'FLCC CSI Cost Estimate Summary'!F43","v":0},{"$f":"'FLCC CSI Cost Estimate Summary'!G43:H43","v":0},null,false,{"$f":"'FLCC CSI Cost Estimate Summary'!$J43","v":0},{"$f":"C43","v":"Name"},null,{"$f":"'FLCC CSI Cost Estimate Summary'!M43:N46","v":0},null,"Base Bid",{"$f":"'FLCC CSI Cost Estimate Summary'!P43","v":0},{"$f":"IF(S43=$S$1,SUM(P43:P46),0)","v":0},null,"False","","","","","","","","","","","","","","","",{"$f":"IF($S43=\"true\",#REF!,\"\")","v":""},""]
[null,null,{"$f":"'FLCC CSI Cost Estimate Summary'!C44:D44","v":"Name"},null,{"$f":"'FLCC CSI Cost Estimate Summary'!E44","v":false},{"$f":"'FLCC CSI Cost Estimate Summary'!F44","v":0},{"$f":"'FLCC CSI Cost Estimate Summary'!G44:H44","v":0},null,{"$f":"'FLCC CSI Cost Estimate Summary'!J44","v":0},{"$f":"'FLCC CSI Cost Estimate Summary'!$J44","v":0},null,null,null,null,"Alternate",{"$f":"'FLCC CSI Cost Estimate Summary'!P44","v":0},null,null,"False","","","","","","","","","","","","","","","",{"$f":"IF($S44=\"true\",#REF!,\"\")","v":""},""]
[null,null,{"$f":"'FLCC CSI Cost Estimate Summary'!C45:D45","v":"Name"},null,{"$f":"'FLCC CSI Cost Estimate Summary'!E45","v":false},{"$f":"'FLCC CSI Cost Estimate Summary'!F45","v":0},{"$f":"'FLCC CSI Cost Estimate Summary'!G45:H45","v":0},null,{"$f":"'FLCC CSI Cost Estimate Summary'!J45","v":0},{"$f":"'FLCC CSI Cost Estimate Summary'!$J45","v":0},null,null,null,null,"Alternate",{"$f":"'FLCC CSI Cost Estimate Summary'!P45","v":0},null,null,"False","","","","","","","","","","","","","","","",{"$f":"IF($S45=\"true\",#REF!,\"\")","v":""},""]
[null,null,{"$f":"'FLCC CSI Cost Estimate Summary'!C46:D46","v":"Name"},null,{"$f":"'FLCC CSI Cost Estimate Summary'!E46","v":false},{"$f":"'FLCC CSI Cost Estimate Summary'!F46","v":0},{"$f":"'FLCC CSI Cost Estimate Summary'!G46:H46","v":0},null,{"$f":"'FLCC CSI Cost Estimate Summary'!J46","v":0},{"$f":"'FLCC CSI Cost Estimate Summary'!$J46","v":0},null,null,null,null,"Alternate",{"$f":"'FLCC CSI Cost Estimate Summary'!P46","v":0},null,null,"False","","","","","","","","","","","","","","","",{"$f":"IF($S46=\"true\",#REF!,\"\")","v":""},""]
[{"$f":"'FLCC CSI Cost Estimate Summary'!A47:P47","v":"Contractor Scope/Trade Detail:"},null,null,null,null,null,null,null,null,null,null,null,null,null,null,null,"AEC PM Approval:",null,"False","","","","","","","","","","","","","","","",{"$f":"IF($S47=\"true\",#REF!,\"\")","v":""},""]
[{"$f":"'FLCC CSI Cost Estimate Summary'!A48:B51","v":0},null,{"$f":"'FLCC CSI Cost Estimate Summary'!C48:D48","v":"Name"},null,{"$f":"'FLCC CSI Cost Estimate Summary'!E48","v":false},{"$f":"'FLCC CSI Cost Estimate Summary'!F48","v":0},{"$f":"'FLCC CSI Cost Estimate Summary'!G48:H48","v":0},null,{"$f":"'FLCC CSI Cost Estimate Summary'!J48","v":0},{"$f":"'FLCC CSI Cost Estimate Summary'!$J48","v":0},{"$f":"C48","v":"Name"},null,{"$f":"'FLCC CSI Cost Estimate Summary'!M48:N51","v":0},null,"Base Bid",{"$f":"'FLCC CSI Cost Estimate Summary'!P48","v":0},{"$f":"IF(S48=$S$1,SUM(P48:P51),0)","v":0},null,"False","","","","","","","","","","","","","","","",{"$f":"IF($S48=\"true\",#REF!,\"\")","v":""},""]
[null,null,{"$f":"'FLCC CSI Cost Estimate Summary'!C49:D49","v":"Name"},null,{"$f":"'FLCC CSI Cost Estimate Summary'!E49","v":false},{"$f":"'FLCC CSI Cost Estimate Summary'!F49","v":0},{"$f":"'FLCC CSI Cost Estimate Summary'!G49:H49","v":0},null,{"$f":"'FLCC CSI Cost Estimate Summary'!J49","v":0},{"$f":"'FLCC CSI Cost Estimate Summary'!$J49","v":0},null,null,null,null,"Alternate",{"$f":"'FLCC CSI Cost Estimate Summary'!P49","v":0},null,null,"False","","","","","","","","","","","","","","","",{"$f":"IF($S49=\"true\",#REF!,\"\")","v":""},""]
[null,null,{"$f":"'FLCC CSI Cost Estimate Summary'!C50:D50","v":"Name"},null,{"$f":"'FLCC CSI Cost Estimate Summary'!E50","v":false},{"$f":"'FLCC CSI Cost Estimate Summary'!F50","v":0},{"$f":"'FLCC CSI Cost Estimate Summary'!G50:H50","v":0},null,{"$f":"'FLCC CSI Cost Estimate Summary'!J50","v":0},{"$f":"'FLCC CSI Cost Estimate Summary'!$J50","v":0},null,null,null,null,"Alternate",{"$f":"'FLCC CSI Cost Estimate Summary'!P50","v":0},null,null,"False","","","","","","","","","","","","","","",{"$f":"IF($S50=\"true\",#REF!,\"\")","v":""},{"$f":"IF($S50=\"true\",#REF!,\"\")","v":""},""]
[null,null,{"$f":"'FLCC CSI Cost Estimate Summary'!C51:D51","v":"Name"},null,{"$f":"'FLCC CSI Cost Estimate Summary'!E51","v":false},{"$f":"'FLCC CSI Cost Estimate Summary'!F51","v":0},{"$f":"'FLCC CSI Cost Estimate Summary'!G51:H51","v":0},null,{"$f":"'FLCC CSI Cost Estimate Summary'!J51","v":0},{"$f":"'FLCC CSI Cost Estimate Summary'!$J51","v":0},null,null,null,null,"Alternate",{"$f":"'FLCC CSI Cost Estimate Summary'!P51","v":0},null,null,"False","","","","","","","","","","","","","",{"$f":"IF($S51=\"true\",#REF!,\"\")","v":""},{"$f":"IF($S51=\"true\",#REF!,\"\")","v":""},{"$f":"IF($S51=\"true\",#REF!,\"\")","v":""},""]
[{"$f":"'FLCC CSI Cost Estimate Summary'!A52:P52","v":"Contractor Scope/Trade Detail:"},null,null,null,null,null,null,null,null,null,null,null,null,null,null,null,"AEC PM Approval:",null,"False","","","","","","","","","","","","",{"$f":"IF($S52=\"true\",#REF!,\"\")","v":""},{"$f":"IF($S52=\"true\",#REF!,\"\")","v":""},{"$f":"IF($S52=\"true\",#REF!,\"\")","v":""},{"$f":"IF($S52=\"true\",#REF!,\"\")","v":""},""]
[{"$f":"'FLCC CSI Cost Estimate Summary'!A53:B56","v":0},null,{"$f":"'FLCC CSI Cost Estimate Summary'!C53:D53","v":"Name"},null,false,{"$f":"'FLCC CSI Cost Estimate Summary'!F53","v":0},{"$f":"'FLCC CSI Cost Estimate Summary'!G53:H53","v":0},null,{"$f":"'FLCC CSI Cost Estimate Summary'!I53","v":0},{"$f":"'FLCC CSI Cost Estimate Summary'!$J53","v":0},{"$f":"C53","v":"Name"},null,{"$f":"'FLCC CSI Cost Estimate Summary'!M53:N56","v":0},null,"Base Bid",{"$f":"'FLCC CSI Cost Estimate Summary'!P53","v":0},{"$f":"IF(S53=$S$1,SUM(P53:P56),0)","v":0},null,"False","","","","","","","","","","",{"$f":"IF($S53=\"true\",M53,\"\")","v":""},{"$f":"IF($S53=\"true\",P53,\"\")","v":""},{"$f":"IF($S53=\"true\",P54,\"\")","v":""},{"$f":"IF($S53=\"true\",P55,\"\")","v":""},{"$f":"IF($S53=\"true\",P56,\"\")","v":""},{"$f":"IF($S53=\"true\",#REF!,\"\")","v":""},""]
[null,null,{"$f":"'FLCC CSI Cost Estimate Summary'!C54:D54","v":"Name"},null,true,{"$f":"'FLCC CSI Cost Estimate Summary'!F54","v":0},{"$f":"'FLCC CSI Cost Estimate Summary'!G54:H54","v":0},null,{"$f":"'FLCC CSI Cost Estimate Summary'!I54","v":false},{"$f":"'FLCC CSI Cost Estimate Summary'!$J54","v":0},null,null,null,null,"Alternate",{"$f":"'FLCC CSI Cost Estimate Summary'!P54","v":0},null,null,"True",0,"Name",true,"A","A",0,"A","A","A",0,{"$f":"IF($S54=\"true\",M54,\"\")","v":0},{"$f":"IF($S54=\"true\",P54,\"\")","v":0},{"$f":"IF($S54=\"true\",P55,\"\")","v":0},{"$f":"IF($S54=\"true\",P56,\"\")","v":0},{"$f":"IF($S54=\"true\",P57,\"\")","v":0},{"$f":"IF($S54=\"true\",#REF!,\"\")","v":{"$error":"#REF!"}},0]
[null,null,{"$f":"'FLCC CSI Cost Estimate Summary'!C55:D55","v":"Name"},null,{"$f":"'FLCC CSI Cost Estimate Summary'!E55","v":false},{"$f":"'FLCC CSI Cost Estimate Summary'!F55","v":0},{"$f":"'FLCC CSI Cost Estimate Summary'!G55:H55","v":0},null,{"$f":"'FLCC CSI Cost Estimate Summary'!I55","v":false},{"$f":"'FLCC CSI Cost Estimate Summary'!$J55","v":0},null,null,null,null,"Alternate",{"$f":"'FLCC CSI Cost Estimate Summary'!P55","v":0},null,null,"False","","","","","","","","","","",{"$f":"IF($S55=\"true\",M55,\"\")","v":""},{"$f":"IF($S55=\"true\",P55,\"\")","v":""},{"$f":"IF($S55=\"true\",P56,\"\")","v":""},{"$f":"IF($S55=\"true\",P57,\"\")","v":""},{"$f":"IF($S55=\"true\",#REF!,\"\")","v":""},{"$f":"IF($S55=\"true\",#REF!,\"\")","v":""},""]
[null,null,{"$f":"'FLCC CSI Cost Estimate Summary'!C56:D56","v":"Name"},null,{"$f":"'FLCC CSI Cost Estimate Summary'!E56","v":false},{"$f":"'FLCC CSI Cost Estimate Summary'!F56","v":0},{"$f":"'FLCC CSI Cost Estimate Summary'!G56:H56","v":0},null,{"$f":"'FLCC CSI Cost Estimate Summary'!I56","v":0},{"$f":"'FLCC CSI Cost Estimate Summary'!$J56","v":0},null,null,null,null,"Alternate",{"$f":"'FLCC CSI Cost Estimate Summary'!P56","v":0},null,null,"False","","","","","","","","","","",{"$f":"IF($S56=\"true\",M56,\"\")","v":""},{"$f":"IF($S56=\"true\",P56,\"\")","v":""},{"$f":"IF($S56=\"true\",P57,\"\")","v":""},{"$f":"IF($S56=\"true\",#REF!,\"\")","v":""},{"$f":"IF($S56=\"true\",#REF!,\"\")","v":""},{"$f":"IF($S56=\"true\",#REF!,\"\")","v":""},""]
[{"$f":"'FLCC CSI Cost Estimate Summary'!A57:P57","v":"Contractor Scope/Trade Detail:"},null,null,null,null,null,null,null,null,null,null,null,null,null,null,null,"AEC PM Approval:",null,"False","","","","","","","","","","",null,null,null,null,null,null,""]
[{"$f":"'FLCC CSI Cost Estimate Summary'!A58:B61","v":0},null,{"$f":"'FLCC CSI Cost Estimate Summary'!C58:D58","v":"Name"},null,{"$f":"'FLCC CSI Cost Estimate Summary'!E58","v":false},{"$f":"'FLCC CSI Cost Estimate Summary'!F58","v":0},{"$f":"'FLCC CSI Cost Estimate Summary'!G58:H58","v":0},null,{"$f":"'FLCC CSI Cost Estimate Summary'!I58","v":0},{"$f":"'FLCC CSI Cost Estimate Summary'!$J58","v":0},{"$f":"C58","v":"Name"},null,{"$f":"'FLCC CSI Cost Estimate Summary'!M58:N61","v":0},null,"Base Bid",{"$f":"'FLCC CSI Cost Estimate Summary'!P58","v":0},{"$f":"IF(S58=$S$1,SUM(P58:P61),0)","v":0},null,"False","","","","","","","","","","",{"$f":"IF($S58=\"true\",M58,\"\")","v":""},{"$f":"IF($S58=\"true\",P58,\"\")","v":""},{"$f":"IF($S58=\"true\",P59,\"\")","v":""},{"$f":"IF($S58=\"true\",P60,\"\")","v":""},{"$f":"IF($S58=\"true\",P61,\"\")","v":""},{"$f":"IF($S58=\"true\",#REF!,\"\")","v":""},""]
[null,null,{"$f":"'FLCC CSI Cost Estimate Summary'!C59:D59","v":"Name"},null,{"$f":"'FLCC CSI Cost Estimate Summary'!E59","v":false},{"$f":"'FLCC CSI Cost Estimate Summary'!F59","v":0},{"$f":"'FLCC CSI Cost Estimate Summary'!G59:H59","v":0},null,{"$f":"'FLCC CSI Cost Estimate Summary'!I59","v":false},{"$f":"'FLCC CSI Cost Estimate Summary'!$J59","v":0},null,null,null,null,"Alternate",{"$f":"'FLCC CSI Cost Estimate Summary'!P59","v":0},null,null,"False","","","","","","","","","","",{"$f":"IF($S59=\"true\",M59,\"\")","v":""},{"$f":"IF($S59=\"true\",P59,\"\")","v":""},{"$f":"IF($S59=\"true\",P60,\"\")","v":""},{"$f":"IF($S59=\"true\",P61,\"\")","v":""},{"$f":"IF($S59=\"true\",P62,\"\")","v":""},{"$f":"IF($S59=\"true\",#REF!,\"\")","v":""},""]
[null,null,{"$f":"'FLCC CSI Cost Estimate Summary'!C60:D60","v":"Name"},null,false,{"$f":"'FLCC CSI Cost Estimate Summary'!F60","v":0},{"$f":"'FLCC CSI Cost Estimate Summary'!G60:H60","v":0},null,{"$f":"'FLCC CSI Cost Estimate Summary'!I60","v":false},{"$f":"'FLCC CSI Cost Estimate Summary'!$J60","v":0},null,null,null,null,"Alternate",{"$f":"'FLCC CSI Cost Estimate Summary'!P60","v":0},null,null,"False","","","","","","","","","","",{"$f":"IF($S60=\"true\",M60,\"\")","v":""},{"$f":"IF($S60=\"true\",P60,\"\")","v":""},{"$f":"IF($S60=\"true\",P61,\"\")","v":""},{"$f":"IF($S60=\"true\",P62,\"\")","v":""},{"$f":"IF($S60=\"true\",#REF!,\"\")","v":""},{"$f":"IF($S60=\"true\",#REF!,\"\")","v":""},""]
[null,null,{"$f":"'FLCC CSI Cost Estimate Summary'!C61:D61","v":"Name"},null,{"$f":"'FLCC CSI Cost Estimate Summary'!E61","v":false},{"$f":"'FLCC CSI Cost Estimate Summary'!F61","v":0},{"$f":"'FLCC CSI Cost Estimate Summary'!G61:H61","v":0},null,{"$f":"'FLCC CSI Cost Estimate Summary'!I61","v":0},{"$f":"'FLCC CSI Cost Estimate Summary'!$J61","v":0},null,null,null,null,"Alternate",{"$f":"'FLCC CSI Cost Estimate Summary'!P61","v":0},null,null,"False","","","","","","","","","","",{"$f":"IF($S61=\"true\",M61,\"\")","v":""},{"$f":"IF($S61=\"true\",P61,\"\")","v":""},{"$f":"IF($S61=\"true\",P62,\"\")","v":""},{"$f":"IF($S61=\"true\",#REF!,\"\")","v":""},{"$f":"IF($S61=\"true\",#REF!,\"\")","v":""},{"$f":"IF($S61=\"true\",#REF!,\"\")","v":""},""]
[{"$f":"'FLCC CSI Cost Estimate Summary'!A62:P62","v":"Contractor Scope/Trade Detail:"},null,null,null,null,null,null,null,null,null,null,null,null,null,null,null,"AEC PM Approval:",null,"False","","","","","","","","","","",null,null,null,null,null,null,""]
[{"$f":"'FLCC CSI Cost Estimate Summary'!A63:B66","v":0},null,{"$f":"'FLCC CSI Cost Estimate Summary'!C63:D63","v":"Name"},null,{"$f":"'FLCC CSI Cost Estimate Summary'!E63","v":false},{"$f":"'FLCC CSI Cost Estimate Summary'!F63","v":0},{"$f":"'FLCC CSI Cost Estimate Summary'!G63:H63","v":0},null,{"$f":"'FLCC CSI Cost Estimate Summary'!I63","v":0},{"$f":"'FLCC CSI Cost Estimate Summary'!$J63","v":0},{"$f":"C63","v":"Name"},null,{"$f":"'FLCC CSI Cost Estimate Summary'!M63:N66","v":0},null,"Base Bid",{"$f":"'FLCC CSI Cost Estimate Summary'!P63","v":0},{"$f":"IF(S63=$S$1,SUM(P63:P66),0)","v":0},null,"False","","","","","","","","","","",{"$f":"IF($S63=\"true\",M63,\"\")","v":""},{"$f":"IF($S63=\"true\",P63,\"\")","v":""},{"$f":"IF($S63=\"true\",P64,\"\")","v":""},{"$f":"IF($S63=\"true\",P65,\"\")","v":""},{"$f":"IF($S63=\"true\",P66,\"\")","v":""},{"$f":"IF($S63=\"true\",#REF!,\"\")","v":""},""]
[null,null,{"$f":"'FLCC CSI Cost Estimate Summary'!C64:D64","v":"Name"},null,{"$f":"'FLCC CSI Cost Estimate Summary'!E64","v":false},{"$f":"'FLCC CSI Cost Estimate Summary'!F64","v":0},{"$f":"'FLCC CSI Cost Estimate Summary'!G64:H64","v":0},null,{"$f":"'FLCC CSI Cost Estimate Summary'!I64","v":false},{"$f":"'FLCC CSI Cost Estimate Summary'!$J64","v":0},null,null,null,null,"Alternate",{"$f":"'FLCC CSI Cost Estimate Summary'!P64","v":0},null,null,"False","","","","","","","","","","",{"$f":"IF($S64=\"true\",M64,\"\")","v":""},{"$f":"IF($S64=\"true\",P64,\"\")","v":""},{"$f":"IF($S64=\"true\",P65,\"\")","v":""},{"$f":"IF($S64=\"true\",P66,\"\")","v":""},{"$f":"IF($S64=\"true\",P67,\"\")","v":""},{"$f":"IF($S64=\"true\",#REF!,\"\")","v":""},""]
[null,null,{"$f":"'FLCC CSI Cost Estimate Summary'!C65:D65","v":"Name"},null,{"$f":"'FLCC CSI Cost Estimate Summary'!E65","v":false},{"$f":"'FLCC CSI Cost Estimate Summary'!F65","v":0},{"$f":"'FLCC CSI Cost Estimate Summary'!G65:H65","v":0},null,{"$f":"'FLCC CSI Cost Estimate Summary'!I65","v":false},{"$f":"'FLCC CSI Cost Estimate Summary'!$J65","v":false},null,null,null,null,"Alternate",{"$f":"'FLCC CSI Cost Estimate Summary'!P65","v":0},null,null,"False","","","","","","","","","","",{"$f":"IF($S65=\"true\",M65,\"\")","v":""},{"$f":"IF($S65=\"true\",P65,\"\")","v":""},{"$f":"IF($S65=\"true\",P66,\"\")","v":""},{"$f":"IF($S65=\"true\",P67,\"\")","v":""},{"$f":"IF($S65=\"true\",#REF!,\"\")","v":""},{"$f":"IF($S65=\"true\",#REF!,\"\")","v":""},{"$f":"IF($S65=\"true\",SUM(P65:P103),\"\")","v":""}]
[null,null,{"$f":"'FLCC CSI Cost Estimate Summary'!C66:D66","v":"Name"},null,{"$f":"'FLCC CSI Cost Estimate Summary'!E66","v":false},{"$f":"'FLCC CSI Cost Estimate Summary'!F66","v":0},{"$f":"'FLCC CSI Cost Estimate Summary'!G66:H66","v":0},null,{"$f":"'FLCC CSI Cost Estimate Summary'!I66","v":0},{"$f":"'FLCC CSI Cost Estimate Summary'!$J66","v":0},null,null,null,null,"Alternate",{"$f":"'FLCC CSI Cost Estimate Summary'!P66","v":0},null,null,"False","","","","","","","","","","",{"$f":"IF($S66=\"true\",M66,\"\")","v":""},{"$f":"IF($S66=\"true\",P66,\"\")","v":""},{"$f":"IF($S66=\"true\",P67,\"\")","v":""},{"$f":"IF($S66=\"true\",#REF!,\"\")","v":""},{"$f":"IF($S66=\"true\",#REF!,\"\")","v":""},{"$f":"IF($S66=\"true\",#REF!,\"\")","v":""},{"$f":"IF($S66=\"true\",SUM(P66:P104),\"\")","v":""}]
[{"$f":"'FLCC CSI Cost Estimate Summary'!A67:P67","v":"Contractor Scope/Trade Detail:"},null,null,null,null,null,null,null,null,null,null,null,null,null,null,null,"AEC PM Approval:",null,"False","","","","","","","","","","",null,null,null,null,null,null,{"$f":"IF($S67=\"true\",SUM(P67:P105),\"\")","v":""}]
[{"$f":"'FLCC CSI Cost Estimate Summary'!A68:B71","v":0},null,{"$f":"'FLCC CSI Cost Estimate Summary'!C68:D68","v":"Name"},null,{"$f":"'FLCC CSI Cost Estimate Summary'!E68","v":false},{"$f":"'FLCC CSI Cost Estimate Summary'!F68","v":0},{"$f":"'FLCC CSI Cost Estimate Summary'!G68:H68","v":0},null,false,{"$f":"'FLCC CSI Cost Estimate Summary'!$J68","v":0},{"$f":"C68","v":"Name"},null,{"$f":"'FLCC CSI Cost Estimate Summary'!M68:N71","v":0},null,"Base Bid",{"$f":"'FLCC CSI Cost Estimate Summary'!P68","v":0},{"$f":"IF(S68=$S$1,SUM(P68:P71),0)","v":0},null,"False","","","","","","","","","","",{"$f":"IF($S68=\"true\",M68,\"\")","v":""},{"$f":"IF($S68=\"true\",P68,\"\")","v":""},{"$f":"IF($S68=\"true\",P69,\"\")","v":""},{"$f":"IF($S68=\"true\",P70,\"\")","v":""},{"$f":"IF($S68=\"true\",P71,\"\")","v":""},{"$f":"IF($S68=\"true\",#REF!,\"\")","v":""},{"$f":"IF($S68=\"true\",SUM(P68:P71),\"\")","v":""}]
[null,null,{"$f":"'FLCC CSI Cost Estimate Summary'!C69:D69","v":"Name"},null,{"$f":"'FLCC CSI Cost Estimate Summary'!E69","v":false},{"$f":"'FLCC CSI Cost Estimate Summary'!F69","v":0},{"$f":"'FLCC CSI Cost Estimate Summary'!G69:H69","v":0},null,null,{"$f":"'FLCC CSI Cost Estimate Summary'!$J69","v":0},null,null,null,null,"Alternate",{"$f":"'FLCC CSI Cost Estimate Summary'!P69","v":0},null,null,"False","","","","","","","","","","",{"$f":"IF($S69=\"true\",M69,\"\")","v":""},{"$f":"IF($S69=\"true\",P69,\"\")","v":""},{"$f":"IF($S69=\"true\",P70,\"\")","v":""},{"$f":"IF($S69=\"true\",P71,\"\")","v":""},{"$f":"IF($S69=\"true\",P72,\"\")","v":""},{"$f":"IF($S69=\"true\",#REF!,\"\")","v":""},{"$f":"IF($S69=\"true\",SUM(P69:P72),\"\")","v":""}]
[null,null,{"$f":"'FLCC CSI Cost Estimate Summary'!C70:D70","v":"Name"},null,{"$f":"'FLCC CSI Cost Estimate Summary'!E70","v":false},{"$f":"'FLCC CSI Cost Estimate Summary'!F70","v":0},{"$f":"'FLCC CSI Cost Estimate Summary'!G70:H70","v":0},null,false,{"$f":"'FLCC CSI Cost Estimate Summary'!$J70","v":false},null,null,null,null,"Alternate",{"$f":"'FLCC CSI Cost Estimate Summary'!P70","v":0},null,null,"False","","","","","","","","","","",{"$f":"IF($S70=\"true\",M70,\"\")","v":""},{"$f":"IF($S70=\"true\",P70,\"\")","v":""},{"$f":"IF($S70=\"true\",P71,\"\")","v":""},{"$f":"IF($S70=\"true\",P72,\"\")","v":""},{"$f":"IF($S70=\"true\",#REF!,\"\")","v":""},{"$f":"IF($S70=\"true\",#REF!,\"\")","v":""},{"$f":"IF($S70=\"true\",SUM(P70:P108),\"\")","v":""}]
[null,null,{"$f":"'FLCC CSI Cost Estimate Summary'!C71:D71","v":"Name"},null,{"$f":"'FLCC CSI Cost Estimate Summary'!E71","v":false},{"$f":"'FLCC CSI Cost Estimate Summary'!F71","v":0},{"$f":"'FLCC CSI Cost Estimate Summary'!G71:H71","v":0},null,null,{"$f":"'FLCC CSI Cost Estimate Summary'!$J71","v":0},null,null,null,null,"Alternate",{"$f":"'FLCC CSI Cost Estimate Summary'!P71","v":0},null,null,"False","","","","","","","","","","",{"$f":"IF($S71=\"true\",M71,\"\")","v":""},{"$f":"IF($S71=\"true\",P71,\"\")","v":""},{"$f":"IF($S71=\"true\",P72,\"\")","v":""},{"$f":"IF($S71=\"true\",#REF!,\"\")","v":""},{"$f":"IF($S71=\"true\",#REF!,\"\")","v":""},{"$f":"IF($S71=\"true\",#REF!,\"\")","v":""},{"$f":"IF($S71=\"true\",SUM(P71:P109),\"\")","v":""}]
[{"$f":"'FLCC CSI Cost Estimate Summary'!A72:P72","v":"Contractor Scope/Trade Detail:"},null,null,null,null,null,null,null,null,null,null,null,null,null,null,null,"AEC PM Approval:",null,"False","","","","","","","","","","",null,null,null,null,null,null,{"$f":"IF($S72=\"true\",SUM(P72:P110),\"\")","v":""}]
[{"$f":"'FLCC CSI Cost Estimate Summary'!A73:B76","v":0},null,{"$f":"'FLCC CSI Cost Estimate Summary'!C73:D73","v":"Name"},null,{"$f":"'FLCC CSI Cost Estimate Summary'!E73","v":false},{"$f":"'FLCC CSI Cost Estimate Summary'!F73","v":0},{"$f":"'FLCC CSI Cost Estimate Summary'!G73:H73","v":0},null,null,{"$f":"'FLCC CSI Cost Estimate Summary'!$J73","v":0},{"$f":"C73","v":"Name"},null,{"$f":"'FLCC CSI Cost Estimate Summary'!M73:N76","v":0},null,"Base Bid",{"$f":"'FLCC CSI Cost Estimate Summary'!P73","v":0},{"$f":"IF(S73=$S$1,SUM(P73:P76),0)","v":0},null,"False","","","","","","","","","","",{"$f":"IF($S73=\"true\",M73,\"\")","v":""},{"$f":"IF($S73=\"true\",P73,\"\")","v":""},{"$f":"IF($S73=\"true\",P74,\"\")","v":""},{"$f":"IF($S73=\"true\",P75,\"\")","v":""},{"$f":"IF($S73=\"true\",P76,\"\")","v":""},{"$f":"IF($S73=\"true\",#REF!,\"\")","v":""},{"$f":"IF($S73=\"true\",SUM(P73:P76),\"\")","v":""}]
[null,null,{"$f":"'FLCC CSI Cost Estimate Summary'!C74:D74","v":"Name"},null,{"$f":"'FLCC CSI Cost Estimate Summary'!E74","v":false},{"$f":"'FLCC CSI Cost Estimate Summary'!F74","v":0},{"$f":"'FLCC CSI Cost Estimate Summary'!G74:H74","v":0},null,null,{"$f":"'FLCC CSI Cost Estimate Summary'!$J74","v":0},null,null,null,null,"Alternate",{"$f":"'FLCC CSI Cost Estimate Summary'!P74","v":0},null,null,"False","","","","","","","","","","",{"$f":"IF($S74=\"true\",M74,\"\")","v":""},{"$f":"IF($S74=\"true\",P74,\"\")","v":""},{"$f":"IF($S74=\"true\",P75,\"\")","v":""},{"$f":"IF($S74=\"true\",P76,\"\")","v":""},{"$f":"IF($S74=\"true\",P77,\"\")","v":""},{"$f":"IF($S74=\"true\",#REF!,\"\")","v":""},{"$f":"IF($S74=\"true\",SUM(P74:P77),\"\")","v":""}]
[null,null,{"$f":"'FLCC CSI Cost Estimate Summary'!C75:D75","v":"Name"},null,{"$f":"'FLCC CSI Cost Estimate Summary'!E75","v":false},{"$f":"'FLCC CSI Cost Estimate Summary'!F75","v":0},{"$f":"'FLCC CSI Cost Estimate Summary'!G75:H75","v":0},null,false,{"$f":"'FLCC CSI Cost Estimate Summary'!$J75","v":false},null,null,null,null,"Alternate",{"$f":"'FLCC CSI Cost Estimate Summary'!P75","v":0},null,null,"False","","","","","","","","","","",{"$f":"IF($S75=\"true\",M75,\"\")","v":""},{"$f":"IF($S75=\"true\",P75,\"\")","v":""},{"$f":"IF($S75=\"true\",P76,\"\")","v":""},{"$f":"IF($S75=\"true\",P77,\"\")","v":""},{"$f":"IF($S75=\"true\",#REF!,\"\")","v":""},{"$f":"IF($S75=\"true\",#REF!,\"\")","v":""},{"$f":"IF($S75=\"true\",SUM(P75:P108),\"\")","v":""}]
[null,null,{"$f":"'FLCC CSI Cost Estimate Summary'!C76:D76","v":"Name"},null,{"$f":"'FLCC CSI Cost Estimate Summary'!E76","v":false},{"$f":"'FLCC CSI Cost Estimate Summary'!F76","v":0},{"$f":"'FLCC CSI Cost Estimate Summary'!G76:H76","v":0},null,null,{"$f":"'FLCC CSI Cost Estimate Summary'!$J76","v":0},null,null,null,null,"Alternate",{"$f":"'FLCC CSI Cost Estimate Summary'!P76","v":0},null,null,"False","","","","","","","","","","",{"$f":"IF($S76=\"true\",M76,\"\")","v":""},{"$f":"IF($S76=\"true\",P76,\"\")","v":""},{"$f":"IF($S76=\"true\",P77,\"\")","v":""},{"$f":"IF($S76=\"true\",#REF!,\"\")","v":""},{"$f":"IF($S76=\"true\",#REF!,\"\")","v":""},{"$f":"IF($S76=\"true\",#REF!,\"\")","v":""},{"$f":"IF($S76=\"true\",SUM(P76:P109),\"\")","v":""}]
[{"$f":"'FLCC CSI Cost Estimate Summary'!A77:P77","v":"Contractor Scope/Trade Detail:"},null,null,null,null,null,null,null,null,null,null,null,null,null,null,null,"AEC PM Approval:",null,"False","","","","","","","","","","",null,null,null,null,null,null,{"$f":"IF($S77=\"true\",SUM(P77:P110),\"\")","v":""}]
[{"$f":"'FLCC CSI Cost Estimate Summary'!A78:B81","v":0},null,{"$f":"'FLCC CSI Cost Estimate Summary'!C78:D78","v":"Name"},null,{"$f":"'FLCC CSI Cost Estimate Summary'!E78","v":false},{"$f":"'FLCC CSI Cost Estimate Summary'!F78","v":0},{"$f":"'FLCC CSI Cost Estimate Summary'!G78:H78","v":0},null,null,{"$f":"'FLCC CSI Cost Estimate Summary'!$J78","v":0},{"$f":"C78","v":"Name"},null,{"$f":"'FLCC CSI Cost Estimate Summary'!M78:N81","v":0},null,"Base Bid",{"$f":"'FLCC CSI Cost Estimate Summary'!P78","v":0},{"$f":"IF(S78=$S$1,SUM(P78:P81),0)","v":0},null,"False","","","","","","","","","","",{"$f":"IF($S78=\"true\",M78,\"\")","v":""},{"$f":"IF($S78=\"true\",P78,\"\")","v":""},{"$f":"IF($S78=\"true\",P79,\"\")","v":""},{"$f":"IF($S78=\"true\",P80,\"\")","v":""},{"$f":"IF($S78=\"true\",P81,\"\")","v":""},{"$f":"IF($S78=\"true\",#REF!,\"\")","v":""},{"$f":"IF($S78=\"true\",SUM(P78:P81),\"\")","v":""}]
[null,null,{"$f":"'FLCC CSI Cost Estimate Summary'!C79:D79","v":"Name"},null,{"$f":"'FLCC CSI Cost Estimate Summary'!E79","v":false},{"$f":"'FLCC CSI Cost Estimate Summary'!F79","v":0},{"$f":"'FLCC CSI Cost Estimate Summary'!G79:H79","v":0},null,null,{"$f":"'FLCC CSI Cost Estimate Summary'!$J79","v":0},null,null,null,null,"Alternate",{"$f":"'FLCC CSI Cost Estimate Summary'!P79","v":0},null,null,"False","","","","","","","","","","",{"$f":"IF($S79=\"true\",M79,\"\")","v":""},{"$f":"IF($S79=\"true\",P79,\"\")","v":""},{"$f":"IF($S79=\"true\",P80,\"\")","v":""},{"$f":"IF($S79=\"true\",P81,\"\")","v":""},{"$f":"IF($S79=\"true\",P82,\"\")","v":""},{"$f":"IF($S79=\"true\",#REF!,\"\")","v":""},{"$f":"IF($S79=\"true\",SUM(P79:P82),\"\")","v":""}]
[null,null,{"$f":"'FLCC CSI Cost Estimate Summary'!C80:D80","v":"Name"},null,{"$f":"'FLCC CSI Cost Estimate Summary'!E80","v":false},{"$f":"'FLCC CSI Cost Estimate Summary'!F80","v":0},{"$f":"'FLCC CSI Cost Estimate Summary'!G80:H80","v":0},null,false,{"$f":"'FLCC CSI Cost Estimate Summary'!$J80","v":false},null,null,null,null,"Alternate",{"$f":"'FLCC CSI Cost Estimate Summary'!P80","v":0},null,null,"False","","","","","","","","","","",{"$f":"IF($S80=\"true\",M80,\"\")","v":""},{"$f":"IF($S80=\"true\",P80,\"\")","v":""},{"$f":"IF($S80=\"true\",P81,\"\")","v":""},{"$f":"IF($S80=\"true\",P82,\"\")","v":""},{"$f":"IF($S80=\"true\",#REF!,\"\")","v":""},{"$f":"IF($S80=\"true\",#REF!,\"\")","v":""},{"$f":"IF($S80=\"true\",SUM(P80:P108),\"\")","v":""}]
[null,null,{"$f":"'FLCC CSI Cost Estimate Summary'!C81:D81","v":"Name"},null,{"$f":"'FLCC CSI Cost Estimate Summary'!E81","v":false},{"$f":"'FLCC CSI Cost Estimate Summary'!F81","v":0},{"$f":"'FLCC CSI Cost Estimate Summary'!G81:H81","v":0},null,null,{"$f":"'FLCC CSI Cost Estimate Summary'!$J81","v":0},null,null,null,null,"Alternate",{"$f":"'FLCC CSI Cost Estimate Summary'!P81","v":0},null,null,"False","","","","","","","","","","",{"$f":"IF($S81=\"true\",M81,\"\")","v":""},{"$f":"IF($S81=\"true\",P81,\"\")","v":""},{"$f":"IF($S81=\"true\",P82,\"\")","v":""},{"$f":"IF($S81=\"true\",#REF!,\"\")","v":""},{"$f":"IF($S81=\"true\",#REF!,\"\")","v":""},{"$f":"IF($S81=\"true\",#REF!,\"\")","v":""},{"$f":"IF($S81=\"true\",SUM(P81:P109),\"\")","v":""}]
[{"$f":"'FLCC CSI Cost Estimate Summary'!A82:P82","v":"Contractor Scope/Trade Detail:"},null,null,null,null,null,null,null,null,null,null,null,null,null,null,null,"AEC PM Approval:",null,"False","","","","","","","","","","",null,null,null,null,null,null,{"$f":"IF($S82=\"true\",SUM(P82:P110),\"\")","v":""}]
[{"$f":"'FLCC CSI Cost Estimate Summary'!A83:B86","v":0},null,{"$f":"'FLCC CSI Cost Estimate Summary'!C83:D83","v":"Name"},null,{"$f":"'FLCC CSI Cost Estimate Summary'!E83","v":false},{"$f":"'FLCC CSI Cost Estimate Summary'!F83","v":0},{"$f":"'FLCC CSI Cost Estimate Summary'!G83:H83","v":0},null,null,{"$f":"'FLCC CSI Cost Estimate Summary'!$J83","v":0},{"$f":"C83","v":"Name"},null,{"$f":"'FLCC CSI Cost Estimate Summary'!M83:N86","v":0},null,"Base Bid",{"$f":"'FLCC CSI Cost Estimate Summary'!P83","v":0},{"$f":"IF(S83=$S$1,SUM(P83:P86),0)","v":0},null,"False","","","","","","","","","","",{"$f":"IF($S83=\"true\",M83,\"\")","v":""},{"$f":"IF($S83=\"true\",P83,\"\")","v":""},{"$f":"IF($S83=\"true\",P84,\"\")","v":""},{"$f":"IF($S83=\"true\",P85,\"\")","v":""},{"$f":"IF($S83=\"true\",P86,\"\")","v":""},{"$f":"IF($S83=\"true\",#REF!,\"\")","v":""},{"$f":"IF($S83=\"true\",SUM(P83:P86),\"\")","v":""}]
[null,null,{"$f":"'FLCC CSI Cost Estimate Summary'!C84:D84","v":"Name"},null,{"$f":"'FLCC CSI Cost Estimate Summary'!E84","v":false},{"$f":"'FLCC CSI Cost Estimate Summary'!F84","v":0},{"$f":"'FLCC CSI Cost Estimate Summary'!G84:H84","v":0},null,null,{"$f":"'FLCC CSI Cost Estimate Summary'!$J84","v":0},null,null,null,null,"Alternate",{"$f":"'FLCC CSI Cost Estimate Summary'!P84","v":0},null,null,"False","","","","","","","","","","",{"$f":"IF($S84=\"true\",M84,\"\")","v":""},{"$f":"IF($S84=\"true\",P84,\"\")","v":""},{"$f":"IF($S84=\"true\",P85,\"\")","v":""},{"$f":"IF($S84=\"true\",P86,\"\")","v":""},{"$f":"IF($S84=\"true\",P87,\"\")","v":""},{"$f":"IF($S84=\"true\",#REF!,\"\")","v":""},{"$f":"IF($S84=\"true\",SUM(P84:P87),\"\")","v":""}]
[null,null,{"$f":"'FLCC CSI Cost Estimate Summary'!C85:D85","v":"Name"},null,{"$f":"'FLCC CSI Cost Estimate Summary'!E85","v":false},{"$f":"'FLCC CSI Cost Estimate Summary'!F85","v":0},{"$f":"'FLCC CSI Cost Estimate Summary'!G85:H85","v":0},null,false,{"$f":"'FLCC CSI Cost Estimate Summary'!$J85","v":false},null,null,null,null,"Alternate",{"$f":"'FLCC CSI Cost Estimate Summary'!P85","v":0},null,null,"False","","","","","","","","","","",{"$f":"IF($S85=\"true\",M85,\"\")","v":""},{"$f":"IF($S85=\"true\",P85,\"\")","v":""},{"$f":"IF($S85=\"true\",P86,\"\")","v":""},{"$f":"IF($S85=\"true\",P87,\"\")","v":""},{"$f":"IF($S85=\"true\",#REF!,\"\")","v":""},{"$f":"IF($S85=\"true\",#REF!,\"\")","v":""},{"$f":"IF($S85=\"true\",SUM(P85:P108),\"\")","v":""}]
[null,null,{"$f":"'FLCC CSI Cost Estimate Summary'!C86:D86","v":"Name"},null,{"$f":"'FLCC CSI Cost Estimate Summary'!E86","v":false},{"$f":"'FLCC CSI Cost Estimate Summary'!F86","v":0},{"$f":"'FLCC CSI Cost Estimate Summary'!G86:H86","v":0},null,null,{"$f":"'FLCC CSI Cost Estimate Summary'!$J86","v":0},null,null,null,null,"Alternate",{"$f":"'FLCC CSI Cost Estimate Summary'!P86","v":0},null,null,"False","","","","","","","","","","",{"$f":"IF($S86=\"true\",M86,\"\")","v":""},{"$f":"IF($S86=\"true\",P86,\"\")","v":""},{"$f":"IF($S86=\"true\",P87,\"\")","v":""},{"$f":"IF($S86=\"true\",#REF!,\"\")","v":""},{"$f":"IF($S86=\"true\",#REF!,\"\")","v":""},{"$f":"IF($S86=\"true\",#REF!,\"\")","v":""},{"$f":"IF($S86=\"true\",SUM(P86:P109),\"\")","v":""}]
[{"$f":"'FLCC CSI Cost Estimate Summary'!A87:P87","v":"Contractor Scope/Trade Detail:"},null,null,null,null,null,null,null,null,null,null,null,null,null,null,null,"AEC PM Approval:",null,"False","","","","","","","","","","",null,null,null,null,null,null,{"$f":"IF($S87=\"true\",SUM(P87:P110),\"\")","v":""}]
[{"$f":"'FLCC CSI Cost Estimate Summary'!A88:B91","v":0},null,{"$f":"'FLCC CSI Cost Estimate Summary'!C88:D88","v":"Name"},null,{"$f":"'FLCC CSI Cost Estimate Summary'!E88","v":false},{"$f":"'FLCC CSI Cost Estimate Summary'!F88","v":0},{"$f":"'FLCC CSI Cost Estimate Summary'!G88:H88","v":0},null,null,{"$f":"'FLCC CSI Cost Estimate Summary'!$J88","v":0},{"$f":"C88","v":"Name"},null,{"$f":"'FLCC CSI Cost Estimate Summary'!M88:N91","v":0},null,"Base Bid",{"$f":"'FLCC CSI Cost Estimate Summary'!P88","v":0},{"$f":"IF(S88=$S$1,SUM(P88:P91),0)","v":0},null,"False","","","","","","","","","","",{"$f":"IF($S88=\"true\",M88,\"\")","v":""},{"$f":"IF($S88=\"true\",P88,\"\")","v":""},{"$f":"IF($S88=\"true\",P89,\"\")","v":""},{"$f":"IF($S88=\"true\",P90,\"\")","v":""},{"$f":"IF($S88=\"true\",P91,\"\")","v":""},{"$f":"IF($S88=\"true\",#REF!,\"\")","v":""},{"$f":"IF($S88=\"true\",SUM(P88:P91),\"\")","v":""}]
[null,null,{"$f":"'FLCC CSI Cost Estimate Summary'!C89:D89","v":"Name"},null,{"$f":"'FLCC CSI Cost Estimate Summary'!E89","v":false},{"$f":"'FLCC CSI Cost Estimate Summary'!F89","v":0},{"$f":"'FLCC CSI Cost Estimate Summary'!G89:H89","v":0},null,null,{"$f":"'FLCC CSI Cost Estimate Summary'!$J89","v":0},null,null,null,null,"Alternate",{"$f":"'FLCC CSI Cost Estimate Summary'!P89","v":0},null,null,"False","","","","","","","","","","",{"$f":"IF($S89=\"true\",M89,\"\")","v":""},{"$f":"IF($S89=\"true\",P89,\"\")","v":""},{"$f":"IF($S89=\"true\",P90,\"\")","v":""},{"$f":"IF($S89=\"true\",P91,\"\")","v":""},{"$f":"IF($S89=\"true\",P92,\"\")","v":""},{"$f":"IF($S89=\"true\",#REF!,\"\")","v":""},{"$f":"IF($S89=\"true\",SUM(P89:P92),\"\")","v":""}]
[null,null,{"$f":"'FLCC CSI Cost Estimate Summary'!C90:D90","v":"Name"},null,{"$f":"'FLCC CSI Cost Estimate Summary'!E90","v":false},{"$f":"'FLCC CSI Cost Estimate Summary'!F90","v":0},{"$f":"'FLCC CSI Cost Estimate Summary'!G90:H90","v":0},null,false,{"$f":"'FLCC CSI Cost Estimate Summary'!$J90","v":false},null,null,null,null,"Alternate",{"$f":"'FLCC CSI Cost Estimate Summary'!P90","v":0},null,null,"False","","","","","","","","","","",{"$f":"IF($S90=\"true\",M90,\"\")","v":""},{"$f":"IF($S90=\"true\",P90,\"\")","v":""},{"$f":"IF($S90=\"true\",P91,\"\")","v":""},{"$f":"IF($S90=\"true\",P92,\"\")","v":""},{"$f":"IF($S90=\"true\",#REF!,\"\")","v":""},{"$f":"IF($S90=\"true\",#REF!,\"\")","v":""},{"$f":"IF($S90=\"true\",SUM(P90:P108),\"\")","v":""}]
[null,null,{"$f":"'FLCC CSI Cost Estimate Summary'!C91:D91","v":"Name"},null,{"$f":"'FLCC CSI Cost Estimate Summary'!E91","v":false},{"$f":"'FLCC CSI Cost Estimate Summary'!F91","v":0},{"$f":"'FLCC CSI Cost Estimate Summary'!G91:H91","v":0},null,null,{"$f":"'FLCC CSI Cost Estimate Summary'!$J91","v":0},null,null,null,null,"Alternate",{"$f":"'FLCC CSI Cost Estimate Summary'!P91","v":0},null,null,"False","","","","","","","","","","",{"$f":"IF($S91=\"true\",M91,\"\")","v":""},{"$f":"IF($S91=\"true\",P91,\"\")","v":""},{"$f":"IF($S91=\"true\",P92,\"\")","v":""},{"$f":"IF($S91=\"true\",#REF!,\"\")","v":""},{"$f":"IF($S91=\"true\",#REF!,\"\")","v":""},{"$f":"IF($S91=\"true\",#REF!,\"\")","v":""},{"$f":"IF($S91=\"true\",SUM(P91:P109),\"\")","v":""}]
[{"$f":"'FLCC CSI Cost Estimate Summary'!A92:P92","v":"Contractor Scope/Trade Detail:"},null,null,null,null,null,null,null,null,null,null,null,null,null,null,null,"AEC PM Approval:",null,"False","","","","","","","","","","",null,null,null,null,null,null,{"$f":"IF($S92=\"true\",SUM(P92:P110),\"\")","v":""}]
[{"$f":"'FLCC CSI Cost Estimate Summary'!A93:B96","v":0},null,{"$f":"'FLCC CSI Cost Estimate Summary'!C93:D93","v":"Name"},null,{"$f":"'FLCC CSI Cost Estimate Summary'!E93","v":false},{"$f":"'FLCC CSI Cost Estimate Summary'!F93","v":0},{"$f":"'FLCC CSI Cost Estimate Summary'!G93:H93","v":0},null,null,{"$f":"'FLCC CSI Cost Estimate Summary'!$J93","v":0},{"$f":"C93","v":"Name"},null,{"$f":"'FLCC CSI Cost Estimate Summary'!M93:N96","v":0},null,"Base Bid",{"$f":"'FLCC CSI Cost Estimate Summary'!P93","v":0},{"$f":"IF(S93=$S$1,SUM(P93:P96),0)","v":0},null,"False","","","","","","","","","","",{"$f":"IF($S93=\"true\",M93,\"\")","v":""},{"$f":"IF($S93=\"true\",P93,\"\")","v":""},{"$f":"IF($S93=\"true\",P94,\"\")","v":""},{"$f":"IF($S93=\"true\",P95,\"\")","v":""},{"$f":"IF($S93=\"true\",P96,\"\")","v":""},{"$f":"IF($S93=\"true\",#REF!,\"\")","v":""},{"$f":"IF($S93=\"true\",SUM(P93:P96),\"\")","v":""}]
[null,null,{"$f":"'FLCC CSI Cost Estimate Summary'!C94:D94","v":"Name"},null,{"$f":"'FLCC CSI Cost Estimate Summary'!E94","v":false},{"$f":"'FLCC CSI Cost Estimate Summary'!F94","v":0},{"$f":"'FLCC CSI Cost Estimate Summary'!G94:H94","v":0},null,false,{"$f":"'FLCC CSI Cost Estimate Summary'!$J94","v":0},null,null,null,null,"Alternate",{"$f":"'FLCC CSI Cost Estimate Summary'!P94","v":0},null,null,"False","","","","","","","","","","",{"$f":"IF($S94=\"true\",M94,\"\")","v":""},{"$f":"IF($S94=\"true\",P94,\"\")","v":""},{"$f":"IF($S94=\"true\",P95,\"\")","v":""},{"$f":"IF($S94=\"true\",P96,\"\")","v":""},{"$f":"IF($S94=\"true\",P97,\"\")","v":""},{"$f":"IF($S94=\"true\",#REF!,\"\")","v":""},{"$f":"IF($S94=\"true\",SUM(P94:P97),\"\")","v":""}]
[null,null,{"$f":"'FLCC CSI Cost Estimate Summary'!C95:D95","v":"Name"},null,{"$f":"'FLCC CSI Cost Estimate Summary'!E95","v":false},{"$f":"'FLCC CSI Cost Estimate Summary'!F95","v":0},{"$f":"'FLCC CSI Cost Estimate Summary'!G95:H95","v":0},null,false,{"$f":"'FLCC CSI Cost Estimate Summary'!$J95","v":0},null,null,null,null,"Alternate",{"$f":"'FLCC CSI Cost Estimate Summary'!P95","v":0},null,null,"False","","","","","","","","","","",{"$f":"IF($S95=\"true\",M95,\"\")","v":""},{"$f":"IF($S95=\"true\",P95,\"\")","v":""},{"$f":"IF($S95=\"true\",P96,\"\")","v":""},{"$f":"IF($S95=\"true\",P97,\"\")","v":""},{"$f":"IF($S95=\"true\",#REF!,\"\")","v":""},{"$f":"IF($S95=\"true\",#REF!,\"\")","v":""},{"$f":"IF($S95=\"true\",SUM(P95:P108),\"\")","v":""}]
[null,null,{"$f":"'FLCC CSI Cost Estimate Summary'!C96:D96","v":"Name"},null,{"$f":"'FLCC CSI Cost Estimate Summary'!E96","v":false},{"$f":"'FLCC CSI Cost Estimate Summary'!F96","v":0},{"$f":"'FLCC CSI Cost Estimate Summary'!G96:H96","v":0},null,null,{"$f":"'FLCC CSI Cost Estimate Summary'!$J96","v":0},null,null,null,null,"Alternate",{"$f":"'FLCC CSI Cost Estimate Summary'!P96","v":0},null,null,"False","","","","","","","","","","",{"$f":"IF($S96=\"true\",M96,\"\")","v":""},{"$f":"IF($S96=\"true\",P96,\"\")","v":""},{"$f":"IF($S96=\"true\",P97,\"\")","v":""},{"$f":"IF($S96=\"true\",#REF!,\"\")","v":""},{"$f":"IF($S96=\"true\",#REF!,\"\")","v":""},{"$f":"IF($S96=\"true\",#REF!,\"\")","v":""},{"$f":"IF($S96=\"true\",SUM(P96:P109),\"\")","v":""}]
[{"$f":"'FLCC CSI Cost Estimate Summary'!A97:P97","v":"Contractor Scope/Trade Detail:"},null,null,null,null,null,null,null,null,null,null,null,null,null,null,null,"AEC PM Approval:",null,"False","","","","","","","","","","",null,null,null,null,null,null,{"$f":"IF($S97=\"true\",SUM(P97:P110),\"\")","v":""}]
[{"$f":"'FLCC CSI Cost Estimate Summary'!A98:B101","v":0},null,{"$f":"'FLCC CSI Cost Estimate Summary'!C98:D98","v":"Name"},null,{"$f":"'FLCC CSI Cost Estimate Summary'!E98","v":false},{"$f":"'FLCC CSI Cost Estimate Summary'!F98","v":0},{"$f":"'FLCC CSI Cost Estimate Summary'!G98:H98","v":0},null,null,{"$f":"'FLCC CSI Cost Estimate Summary'!$J98","v":0},{"$f":"C98","v":"Name"},null,{"$f":"'FLCC CSI Cost Estimate Summary'!M98:N101","v":0},null,"Base Bid",{"$f":"'FLCC CSI Cost Estimate Summary'!P98","v":0},{"$f":"IF(S98=$S$1,SUM(P98:P101),0)","v":0},null,"False","","","","","","","","","","",{"$f":"IF($S98=\"true\",M98,\"\")","v":""},{"$f":"IF($S98=\"true\",P98,\"\")","v":""},{"$f":"IF($S98=\"true\",P99,\"\")","v":""},{"$f":"IF($S98=\"true\",P100,\"\")","v":""},{"$f":"IF($S98=\"true\",P101,\"\")","v":""},{"$f":"IF($S98=\"true\",#REF!,\"\")","v":""},{"$f":"IF($S98=\"true\",SUM(P98:P101),\"\")","v":""}]
[null,null,{"$f":"'FLCC CSI Cost Estimate Summary'!C99:D99","v":"Name"},null,{"$f":"'FLCC CSI Cost Estimate Summary'!E99","v":false},{"$f":"'FLCC CSI Cost Estimate Summary'!F99","v":0},{"$f":"'FLCC CSI Cost Estimate Summary'!G99:H99","v":0},null,null,{"$f":"'FLCC CSI Cost Estimate Summary'!$J99","v":0},null,null,null,null,"Alternate",{"$f":"'FLCC CSI Cost Estimate Summary'!P99","v":0},null,null,"False","","","","","","","","","","",{"$f":"IF($S99=\"true\",M99,\"\")","v":""},{"$f":"IF($S99=\"true\",P99,\"\")","v":""},{"$f":"IF($S99=\"true\",P100,\"\")","v":""},{"$f":"IF($S99=\"true\",P101,\"\")","v":""},{"$f":"IF($S99=\"true\",P102,\"\")","v":""},{"$f":"IF($S99=\"true\",#REF!,\"\")","v":""},{"$f":"IF($S99=\"true\",SUM(P99:P102),\"\")","v":""}]
[null,null,{"$f":"'FLCC CSI Cost Estimate Summary'!C100:D100","v":"Name"},null,{"$f":"'FLCC CSI Cost Estimate Summary'!E100","v":false},{"$f":"'FLCC CSI Cost Estimate Summary'!F100","v":0},{"$f":"'FLCC CSI Cost Estimate Summary'!G100:H100","v":0},null,null,{"$f":"'FLCC CSI Cost Estimate Summary'!$J100","v":0},null,null,null,null,"Alternate",{"$f":"'FLCC CSI Cost Estimate Summary'!P100","v":0},null,null,"False","","","","","","","","","","",{"$f":"IF($S100=\"true\",M100,\"\")","v":""},{"$f":"IF($S100=\"true\",P100,\"\")","v":""},{"$f":"IF($S100=\"true\",P101,\"\")","v":""},{"$f":"IF($S100=\"true\",P102,\"\")","v":""},{"$f":"IF($S100=\"true\",#REF!,\"\")","v":""},{"$f":"IF($S100=\"true\",#REF!,\"\")","v":""},{"$f":"IF($S100=\"true\",SUM(P100:P108),\"\")","v":""}]
[null,null,{"$f":"'FLCC CSI Cost Estimate Summary'!C101:D101","v":"Name"},null,{"$f":"'FLCC CSI Cost Estimate Summary'!E101","v":false},{"$f":"'FLCC CSI Cost Estimate Summary'!F101","v":0},{"$f":"'FLCC CSI Cost Estimate Summary'!G101:H101","v":0},null,null,{"$f":"'FLCC CSI Cost Estimate Summary'!$J101","v":0},null,null,null,null,"Alternate",{"$f":"'FLCC CSI Cost Estimate Summary'!P101","v":0},null,null,"False","","","","","","","","","","",{"$f":"IF($S101=\"true\",M101,\"\")","v":""},{"$f":"IF($S101=\"true\",P101,\"\")","v":""},{"$f":"IF($S101=\"true\",P102,\"\")","v":""},{"$f":"IF($S101=\"true\",#REF!,\"\")","v":""},{"$f":"IF($S101=\"true\",#REF!,\"\")","v":""},{"$f":"IF($S101=\"true\",#REF!,\"\")","v":""},{"$f":"IF($S101=\"true\",SUM(P101:P109),\"\")","v":""}]
[{"$f":"'FLCC CSI Cost Estimate Summary'!A102:P102","v":"Contractor Scope/Trade Detail:"},null,null,null,null,null,null,null,null,null,null,null,null,null,null,null,"AEC PM Approval:",null,"False","","","","","","","","","","",null,null,null,null,null,null,{"$f":"IF($S102=\"true\",SUM(P102:P110),\"\")","v":""}]
[{"$f":"'FLCC CSI Cost Estimate Summary'!A103:B106","v":0},null,{"$f":"'FLCC CSI Cost Estimate Summary'!C103:D103","v":"Name"},null,{"$f":"'FLCC CSI Cost Estimate Summary'!E103","v":false},{"$f":"'FLCC CSI Cost Estimate Summary'!F103","v":0},{"$f":"'FLCC CSI Cost Estimate Summary'!G103:H103","v":0},null,false,{"$f":"'FLCC CSI Cost Estimate Summary'!$J103","v":false},{"$f":"C103","v":"Name"},null,{"$f":"'FLCC CSI Cost Estimate Summary'!M103:N106","v":0},null,"Base Bid",{"$f":"'FLCC CSI Cost Estimate Summary'!P103","v":0},{"$f":"IF(S103=$S$1,SUM(P103:P106),0)","v":0},null,"False","","","","","","","","","","",{"$f":"IF($S103=\"true\",M103,\"\")","v":""},{"$f":"IF($S103=\"true\",P103,\"\")","v":""},{"$f":"IF($S103=\"true\",P104,\"\")","v":""},{"$f":"IF($S103=\"true\",P105,\"\")","v":""},{"$f":"IF($S103=\"true\",P106,\"\")","v":""},{"$f":"IF($S103=\"true\",#REF!,\"\")","v":""},{"$f":"IF($S103=\"true\",SUM(P103:P106),\"\")","v":""}]
[null,null,{"$f":"'FLCC CSI Cost Estimate Summary'!C104:D104","v":"Name"},null,{"$f":"'FLCC CSI Cost Estimate Summary'!E104","v":false},{"$f":"'FLCC CSI Cost Estimate Summary'!F104","v":0},{"$f":"'FLCC CSI Cost Estimate Summary'!G104:H104","v":0},null,false,{"$f":"'FLCC CSI Cost Estimate Summary'!$J104","v":0},null,null,null,null,"Alternate",{"$f":"'FLCC CSI Cost Estimate Summary'!P104","v":0},null,null,"False","","","","","","","","","","",{"$f":"IF($S104=\"true\",M104,\"\")","v":""},{"$f":"IF($S104=\"true\",P104,\"\")","v":""},{"$f":"IF($S104=\"true\",P105,\"\")","v":""},{"$f":"IF($S104=\"true\",P106,\"\")","v":""},{"$f":"IF($S104=\"true\",P107,\"\")","v":""},{"$f":"IF($S104=\"true\",#REF!,\"\")","v":""},""]
[null,null,{"$f":"'FLCC CSI Cost Estimate Summary'!C105:D105","v":"Name"},null,{"$f":"'FLCC CSI Cost Estimate Summary'!E105","v":false},{"$f":"'FLCC CSI Cost Estimate Summary'!F105","v":0},{"$f":"'FLCC CSI Cost Estimate Summary'!G105:H105","v":0},null,false,{"$f":"'FLCC CSI Cost Estimate Summary'!$J105","v":false},null,null,null,null,"Alternate",{"$f":"'FLCC CSI Cost Estimate Summary'!P105","v":0},null,null,"False","","","","","","","","","","",{"$f":"IF($S105=\"true\",M105,\"\")","v":""},{"$f":"IF($S105=\"true\",P105,\"\")","v":""},{"$f":"IF($S105=\"true\",P106,\"\")","v":""},{"$f":"IF($S105=\"true\",P107,\"\")","v":""},{"$f":"IF($S105=\"true\",#REF!,\"\")","v":""},{"$f":"IF($S105=\"true\",#REF!,\"\")","v":""},{"$f":"IF($S105=\"true\",SUM(P105:P108),\"\")","v":""}]
[null,null,{"$f":"'FLCC CSI Cost Estimate Summary'!C106:D106","v":"Name"},null,{"$f":"'FLCC CSI Cost Estimate Summary'!E106","v":false},{"$f":"'FLCC CSI Cost Estimate Summary'!F106","v":0},{"$f":"'FLCC CSI Cost Estimate Summary'!G106:H106","v":0},null,false,{"$f":"'FLCC CSI Cost Estimate Summary'!$J106","v":0},null,null,null,null,"Alternate",{"$f":"'FLCC CSI Cost Estimate Summary'!P106","v":0},null,null,"False","","","","","","","","","","",{"$f":"IF($S106=\"true\",M106,\"\")","v":""},{"$f":"IF($S106=\"true\",P106,\"\")","v":""},{"$f":"IF($S106=\"true\",P107,\"\")","v":""},{"$f":"IF($S106=\"true\",#REF!,\"\")","v":""},{"$f":"IF($S106=\"true\",#REF!,\"\")","v":""},{"$f":"IF($S106=\"true\",#REF!,\"\")","v":""},{"$f":"IF($S106=\"true\",SUM(P106:P109),\"\")","v":""}]
[{"$f":"'FLCC CSI Cost Estimate Summary'!A107:P107","v":"Contractor Scope/Trade Detail:"},null,null,null,null,null,null,null,null,null,null,null,null,null,null,null,"AEC PM Approval:"]
[null,null,"Name",null,false,null,0,null,null,null,{"$f":"C108","v":"Name"},null,null,null,"Base Bid",0,{"$f":"SUM(P108:P111)","v":0},null,{"$f":"IF(E108,\"True\",\"False\")","v":"False"},{"$f":"IF($S108=\"true\",A108,\"\")","v":""},{"$f":"IF($S108=\"true\",C108,\"\")","v":""},{"$f":"IF($S108=\"true\",E108,\"\")","v":""},"",{"$f":"IF($S108=\"true\",F108,\"\")","v":""},"",{"$f":"IF($S108=\"true\",I108,\"\")","v":""},"",{"$f":"IF($S108=\"true\",J108,\"\")","v":""},"",{"$f":"IF($S108=\"true\",M108,\"\")","v":""},{"$f":"IF($S108=\"true\",P108,\"\")","v":""},{"$f":"IF($S108=\"true\",P109,\"\")","v":""},{"$f":"IF($S108=\"true\",P110,\"\")","v":""},{"$f":"IF($S108=\"true\",P111,\"\")","v":""},{"$f":"IF($S108=\"true\",#REF!,\"\")","v":""},{"$f":"IF($S108=\"true\",Q108,\"\")","v":""}]
[null,null,"Name",null,false,null,0,null,null,null,null,null,null,null,"Alternate",0,null,null,{"$f":"IF(E109,\"True\",\"False\")","v":"False"},{"$f":"IF($S109=\"true\",A109,\"\")","v":""},{"$f":"IF($S109=\"true\",C109,\"\")","v":""},"","","","","","","","",{"$f":"IF($S109=\"true\",M109,\"\")","v":""},{"$f":"IF($S109=\"true\",P109,\"\")","v":""},{"$f":"IF($S109=\"true\",P110,\"\")","v":""},{"$f":"IF($S109=\"true\",P111,\"\")","v":""},{"$f":"IF($S109=\"true\",P112,\"\")","v":""},{"$f":"IF($S109=\"true\",#REF!,\"\")","v":""},{"$f":"IF($S109=\"true\",Q109,\"\")","v":""}]
[null,null,"Name",null,false,null,0,null,null,null,null,null,null,null,"Alternate",0,null,null,{"$f":"IF(E110,\"True\",\"False\")","v":"False"},{"$f":"IF($S110=\"true\",A110,\"\")","v":""},{"$f":"IF($S110=\"true\",C110,\"\")","v":""},"","","","","","","","",{"$f":"IF($S110=\"true\",M110,\"\")","v":""},{"$f":"IF($S110=\"true\",P110,\"\")","v":""},{"$f":"IF($S110=\"true\",P111,\"\")","v":""},{"$f":"IF($S110=\"true\",P112,\"\")","v":""},{"$f":"IF($S110=\"true\",#REF!,\"\")","v":""},{"$f":"IF($S110=\"true\",#REF!,\"\")","v":""},{"$f":"IF($S110=\"true\",Q110,\"\")","v":""}]
[null,null,"Name",null,false,null,0,null,null,null,null,null,null,null,"Alternate",0,null,null,{"$f":"IF(E111,\"True\",\"False\")","v":"False"},{"$f":"IF($S111=\"true\",A111,\"\")","v":""},{"$f":"IF($S111=\"true\",C111,\"\")","v":""},"","","","","","","","",{"$f":"IF($S111=\"true\",M111,\"\")","v":""},{"$f":"IF($S111=\"true\",P111,\"\")","v":""},{"$f":"IF($S111=\"true\",P112,\"\")","v":""},{"$f":"IF($S111=\"true\",#REF!,\"\")","v":""},{"$f":"IF($S111=\"true\",#REF!,\"\")","v":""},{"$f":"IF($S111=\"true\",#REF!,\"\")","v":""},{"$f":"IF($S111=\"true\",Q111,\"\")","v":""}]
["Contractor Scope/Trade Detail:",null,null,null,null,null,null,null,null,null,null,null,null,null,null,null,"PM Approval:"]
[]
[null,null,null,null,null,null,null,null,null,null,null,"Trade Contractor Subtotal:",null,null,null,"Lump Sum",{"$f":"SUBTOTAL(9,Q8:R113)","v":0}]
[]
[]
[]
[]
[]
[]
[]
[]
[]
[]
[]
[]
[]
[]
[]
[]
["Full Time Laborer When Contracturally Required"]
["Scope/Trade\n(Includes CSI #'s for clarity)",null,"Proposed Trade Contractor/Self Perform",null,"Self Perform","Decline Bid or No Response","Proposed Amounts \n(low to high)",null,"No Estimates at GMP",null,"Selected Firm",null,"EMR",null,"Intended Awardee Proposal Detail  & (accepted alternates only)",null,"Total"]
[{"$f":"'FLCC CSI Cost Estimate Summary'!A133:B136","v":0},null,{"$f":"'FLCC CSI Cost Estimate Summary'!C133:D133","v":"Name"},null,"N/A",null,{"$f":"'FLCC CSI Cost Estimate Summary'!G133:H133","v":0},null,null,{"$f":"'FLCC CSI Cost Estimate Summary'!$J133","v":false},{"$f":"C133","v":"Name"},null,{"$f":"'FLCC CSI Cost Estimate Summary'!M133:N136","v":0},null,"Base Bid",{"$f":"'FLCC CSI Cost Estimate Summary'!P133","v":0},{"$f":"SUM(P133:P136)","v":0}]
[null,null,{"$f":"'FLCC CSI Cost Estimate Summary'!C134:D134","v":"Name"},null,"N/A",null,{"$f":"'FLCC CSI Cost Estimate Summary'!G134:H134","v":0},null,null,{"$f":"'FLCC CSI Cost Estimate Summary'!$J134","v":false},null,null,null,null,"Alternate",{"$f":"'FLCC CSI Cost Estimate Summary'!P134","v":0}]
[null,null,{"$f":"'FLCC CSI Cost Estimate Summary'!C135:D135","v":"Name"},null,"N/A",null,{"$f":"'FLCC CSI Cost Estimate Summary'!G135:H135","v":0},null,false,{"$f":"'FLCC CSI Cost Estimate Summary'!$J135","v":false},null,null,null,null,"Alternate",{"$f":"'FLCC CSI Cost Estimate Summary'!P135","v":0}]
[null,null,{"$f":"'FLCC CSI Cost Estimate Summary'!C136:D136","v":"Name"},null,"N/A",null,{"$f":"'FLCC CSI Cost Estimate Summary'!G136:H136","v":0},null,false,{"$f":"'FLCC CSI Cost Estimate Summary'!$J136","v":0},null,null,null,null,"Alternate",{"$f":"'FLCC CSI Cost Estimate Summary'!P136","v":0}]
[{"$f":"'FLCC CSI Cost Estimate Summary'!A137:P137","v":"Contractor Scope/Trade Detail:"},null,null,null,null,null,null,null,null,null,null,null,null,null,null,null,"AEC PM Approval:"]
[{"$f":"'FLCC CSI Cost Estimate Summary'!A138:B141","v":0},null,{"$f":"'FLCC CSI Cost Estimate Summary'!C138:D138","v":"Name"},null,"N/A",null,{"$f":"'FLCC CSI Cost Estimate Summary'!G138:H138","v":0},null,false,{"$f":"'FLCC CSI Cost Estimate Summary'!$J138","v":false},{"$f":"C138","v":"Name"},null,{"$f":"'FLCC CSI Cost Estimate Summary'!M138:N141","v":0},null,"Base Bid",{"$f":"'FLCC CSI Cost Estimate Summary'!P138","v":0},{"$f":"SUM(P138:P141)","v":0}]
[null,null,{"$f":"'FLCC CSI Cost Estimate Summary'!C139:D139","v":"Name"},null,"N/A",null,{"$f":"'FLCC CSI Cost Estimate Summary'!G139:H139","v":0},null,false,{"$f":"'FLCC CSI Cost Estimate Summary'!$J139","v":false},null,null,null,null,"Alternate",{"$f":"'FLCC CSI Cost Estimate Summary'!P139","v":0}]
[null,null,{"$f":"'FLCC CSI Cost Estimate Summary'!C140:D140","v":"Name"},null,"N/A",null,{"$f":"'FLCC CSI Cost Estimate Summary'!G140:H140","v":0},null,false,{"$f":"'FLCC CSI Cost Estimate Summary'!$J140","v":0},null,null,null,null,"Alternate",{"$f":"'FLCC CSI Cost Estimate Summary'!P140","v":0}]
[null,null,{"$f":"'FLCC CSI Cost Estimate Summary'!C141:D141","v":"Name"},null,"N/A",null,{"$f":"'FLCC CSI Cost Estimate Summary'!G141:H141","v":0},null,false,{"$f":"'FLCC CSI Cost Estimate Summary'!$J141","v":false},null,null,null,null,"Alternate",{"$f":"'FLCC CSI Cost Estimate Summary'!P141","v":0}]
[{"$f":"'FLCC CSI Cost Estimate Summary'!A142:P142","v":"Contractor Scope/Trade Detail:"},null,null,null,null,null,null,null,null,null,null,null,null,null,null,null,"PM Approval:"]
[]
[null,null,null,null,null,null,null,null,null,null,null,"Full Time Laborer Subtotal:",null,null,null,"Lump Sum",{"$f":"SUBTOTAL(9,Q133:R142)","v":0}]
[]
["Self- Perform",null,null,null,null,null,null,null,null,null,null,"(Self Performed is not included in Trade Contractor Subtotal)"]
["Scope/Trade",null,"Trade Contractor",null,"Proposed Amount",null,null,null,null,null,null,null,null,null,null,"Proposed Amount","Total"]
[{"$f":"IFERROR(T148:T148,\"\")","v":0},null,{"$f":"IFERROR(U148,\"\")","v":"Name"},null,{"$f":"IFERROR(Y148,\"$\")","v":0},null,null,null,null,null,null,null,null,null,null,{"$f":"IFERROR(AJ148,\"$\")","v":0},{"$f":"SUBTOTAL(9,P148:P159)","v":0},null,null,{"$f":"INDEX($T$8:$AM$112,SMALL(IF(COUNTIF($T$5,$T$8:$AM$112),MATCH(ROW($T$8:$AM$112),ROW($T$8:$AM$112)),\"\"),ROWS(V$152:$V152)),COLUMNS(V$152:$V152))","v":0},{"$f":"INDEX($T$8:$AM$112,SMALL(IF(COUNTIF($T$5,$T$8:$AM$112),MATCH(ROW($T$8:$AM$112),ROW($T$8:$AM$112)),\"\"),ROWS($V$152:W152)),COLUMNS($V$152:W152))","v":"Name"},{"$f":"INDEX($T$8:$AM$112,SMALL(IF(COUNTIF($T$5,$T$8:$AM$112),MATCH(ROW($T$8:$AM$112),ROW($T$8:$AM$112)),\"\"),ROWS($V$152:X152)),COLUMNS($V$152:X152))","v":true},{"$f":"INDEX($T$8:$AM$112,SMALL(IF(COUNTIF($T$5,$T$8:$AM$112),MATCH(ROW($T$8:$AM$112),ROW($T$8:$AM$112)),\"\"),ROWS($V$152:Y152)),COLUMNS($V$152:Y152))","v":"A"},{"$f":"INDEX($T$8:$AM$112,SMALL(IF(COUNTIF($T$5,$T$8:$AM$112),MATCH(ROW($T$8:$AM$112),ROW($T$8:$AM$112)),\"\"),ROWS($V$152:Z152)),COLUMNS($V$152:Z152))","v":"A"},{"$f":"INDEX($T$8:$AM$112,SMALL(IF(COUNTIF($T$5,$T$8:$AM$112),MATCH(ROW($T$8:$AM$112),ROW($T$8:$AM$112)),\"\"),ROWS($V$152:AA152)),COLUMNS($V$152:AA152))","v":0},{"$f":"INDEX($T$8:$AM$112,SMALL(IF(COUNTIF($T$5,$T$8:$AM$112),MATCH(ROW($T$8:$AM$112),ROW($T$8:$AM$112)),\"\"),ROWS($V$152:AB152)),COLUMNS($V$152:AB152))","v":"A"},{"$f":"INDEX($T$8:$AM$112,SMALL(IF(COUNTIF($T$5,$T$8:$AM$112),MATCH(ROW($T$8:$AM$112),ROW($T$8:$AM$112)),\"\"),ROWS($V$152:AC152)),COLUMNS($V$152:AC152))","v":"A"},{"$f":"INDEX($T$8:$AM$112,SMALL(IF(COUNTIF($T$5,$T$8:$AM$112),MATCH(ROW($T$8:$AM$112),ROW($T$8:$AM$112)),\"\"),ROWS($V$152:AD152)),COLUMNS($V$152:AD152))","v":"A"},{"$f":"INDEX($T$8:$AM$112,SMALL(IF(COUNTIF($T$5,$T$8:$AM$112),MATCH(ROW($T$8:$AM$112),ROW($T$8:$AM$112)),\"\"),ROWS($V$152:AE152)),COLUMNS($V$152:AE152))","v":0},{"$f":"INDEX($T$8:$AM$112,SMALL(IF(COUNTIF($T$5,$T$8:$AM$112),MATCH(ROW($T$8:$AM$112),ROW($T$8:$AM$112)),\"\"),ROWS($V$152:AF152)),COLUMNS($V$152:AF152))","v":0},{"$f":"INDEX($T$8:$AM$112,SMALL(IF(COUNTIF($T$5,$T$8:$AM$112),MATCH(ROW($T$8:$AM$112),ROW($T$8:$AM$112)),\"\"),ROWS($V$152:AG152)),COLUMNS($V$152:AG152))","v":0},{"$f":"INDEX($T$8:$AM$112,SMALL(IF(COUNTIF($T$5,$T$8:$AM$112),MATCH(ROW($T$8:$AM$112),ROW($T$8:$AM$112)),\"\"),ROWS($V$152:AH152)),COLUMNS($V$152:AH152))","v":0},{"$f":"INDEX($T$8:$AM$112,SMALL(IF(COUNTIF($T$5,$T$8:$AM$112),MATCH(ROW($T$8:$AM$112),ROW($T$8:$AM$112)),\"\"),ROWS($V$152:AI152)),COLUMNS($V$152:AI152))","v":0},{"$f":"INDEX($T$8:$AM$112,SMALL(IF(COUNTIF($T$5,$T$8:$AM$112),MATCH(ROW($T$8:$AM$112),ROW($T$8:$AM$112)),\"\"),ROWS($V$152:AJ152)),COLUMNS($V$152:AJ152))","v":0},{"$f":"INDEX($T$8:$AM$112,SMALL(IF(COUNTIF($T$5,$T$8:$AM$112),MATCH(ROW($T$8:$AM$112),ROW($T$8:$AM$112)),\"\"),ROWS($V$152:AK152)),COLUMNS($V$152:AK152))","v":{"$error":"#REF!"}},{"$f":"INDEX($T$8:$AM$112,SMALL(IF(COUNTIF($T$5,$T$8:$AM$112),MATCH(ROW($T$8:$AM$112),ROW($T$8:$AM$112)),\"\"),ROWS($V$152:AL152)),COLUMNS($V$152:AL152))","v":0},{"$f":"INDEX($T$8:$AM$112,SMALL(IF(COUNTIF($T$5,$T$8:$AM$112),MATCH(ROW($T$8:$AM$112),ROW($T$8:$AM$112)),\"\"),ROWS($V$152:AM152)),COLUMNS($V$152:AM152))","v":0},{"$f":"INDEX($T$8:$AM$112,SMALL(IF(COUNTIF($T$5,$T$8:$AM$112),MATCH(ROW($T$8:$AM$112),ROW($T$8:$AM$112)),\"\"),ROWS($V$152:AN152)),COLUMNS($V$152:AN152))","v":0},{"$f":"INDEX($T$8:$AM$112,SMALL(IF(COUNTIF($T$5,$T$8:$AM$112),MATCH(ROW($T$8:$AM$112),ROW($T$8:$AM$112)),\"\"),ROWS($V$152:AO152)),COLUMNS($V$152:AO152))","v":0},null,null,null,null,null,null,null,null,null,null,"*"]
["",null,"",null,"$",null,null,null,null,null,null,null,null,null,null,{"$f":"IFERROR(AJ149,\"$\")","v":"$"},null,null,null,{"$f":"INDEX($T$8:$AM$112,SMALL(IF(COUNTIF($T$5,$T$8:$AM$112),MATCH(ROW($T$8:$AM$112),ROW($T$8:$AM$112)),\"\"),ROWS(V$152:$V153)),COLUMNS(V$152:$V153))","v":{"$error":"#NUM!"}},{"$f":"INDEX($T$8:$AM$112,SMALL(IF(COUNTIF($T$5,$T$8:$AM$112),MATCH(ROW($T$8:$AM$112),ROW($T$8:$AM$112)),\"\"),ROWS($V$152:W153)),COLUMNS($V$152:W153))","v":{"$error":"#NUM!"}},{"$f":"INDEX($T$8:$AM$112,SMALL(IF(COUNTIF($T$5,$T$8:$AM$112),MATCH(ROW($T$8:$AM$112),ROW($T$8:$AM$112)),\"\"),ROWS($V$152:X153)),COLUMNS($V$152:X153))","v":{"$error":"#NUM!"}},{"$f":"INDEX($T$8:$AM$112,SMALL(IF(COUNTIF($T$5,$T$8:$AM$112),MATCH(ROW($T$8:$AM$112),ROW($T$8:$AM$112)),\"\"),ROWS($V$152:Y153)),COLUMNS($V$152:Y153))","v":{"$error":"#NUM!"}},{"$f":"INDEX($T$8:$AM$112,SMALL(IF(COUNTIF($T$5,$T$8:$AM$112),MATCH(ROW($T$8:$AM$112),ROW($T$8:$AM$112)),\"\"),ROWS($V$152:Z153)),COLUMNS($V$152:Z153))","v":{"$error":"#NUM!"}},{"$f":"INDEX($T$8:$AM$112,SMALL(IF(COUNTIF($T$5,$T$8:$AM$112),MATCH(ROW($T$8:$AM$112),ROW($T$8:$AM$112)),\"\"),ROWS($V$152:AA153)),COLUMNS($V$152:AA153))","v":{"$error":"#NUM!"}},{"$f":"INDEX($T$8:$AM$112,SMALL(IF(COUNTIF($T$5,$T$8:$AM$112),MATCH(ROW($T$8:$AM$112),ROW($T$8:$AM$112)),\"\"),ROWS($V$152:AB153)),COLUMNS($V$152:AB153))","v":{"$error":"#NUM!"}},{"$f":"INDEX($T$8:$AM$112,SMALL(IF(COUNTIF($T$5,$T$8:$AM$112),MATCH(ROW($T$8:$AM$112),ROW($T$8:$AM$112)),\"\"),ROWS($V$152:AC153)),COLUMNS($V$152:AC153))","v":{"$error":"#NUM!"}},{"$f":"INDEX($T$8:$AM$112,SMALL(IF(COUNTIF($T$5,$T$8:$AM$112),MATCH(ROW($T$8:$AM$112),ROW($T$8:$AM$112)),\"\"),ROWS($V$152:AD153)),COLUMNS($V$152:AD153))","v":{"$error":"#NUM!"}},{"$f":"INDEX($T$8:$AM$112,SMALL(IF(COUNTIF($T$5,$T$8:$AM$112),MATCH(ROW($T$8:$AM$112),ROW($T$8:$AM$112)),\"\"),ROWS($V$152:AE153)),COLUMNS($V$152:AE153))","v":{"$error":"#NUM!"}},{"$f":"INDEX($T$8:$AM$112,SMALL(IF(COUNTIF($T$5,$T$8:$AM$112),MATCH(ROW($T$8:$AM$112),ROW($T$8:$AM$112)),\"\"),ROWS($V$152:AF153)),COLUMNS($V$152:AF153))","v":{"$error":"#NUM!"}},{"$f":"INDEX($T$8:$AM$112,SMALL(IF(COUNTIF($T$5,$T$8:$AM$112),MATCH(ROW($T$8:$AM$112),ROW($T$8:$AM$112)),\"\"),ROWS($V$152:AG153)),COLUMNS($V$152:AG153))","v":{"$error":"#NUM!"}},{"$f":"INDEX($T$8:$AM$112,SMALL(IF(COUNTIF($T$5,$T$8:$AM$112),MATCH(ROW($T$8:$AM$112),ROW($T$8:$AM$112)),\"\"),ROWS($V$152:AH153)),COLUMNS($V$152:AH153))","v":{"$error":"#NUM!"}},{"$f":"INDEX($T$8:$AM$112,SMALL(IF(COUNTIF($T$5,$T$8:$AM$112),MATCH(ROW($T$8:$AM$112),ROW($T$8:$AM$112)),\"\"),ROWS($V$152:AI153)),COLUMNS($V$152:AI153))","v":{"$error":"#NUM!"}},{"$f":"INDEX($T$8:$AM$112,SMALL(IF(COUNTIF($T$5,$T$8:$AM$112),MATCH(ROW($T$8:$AM$112),ROW($T$8:$AM$112)),\"\"),ROWS($V$152:AJ153)),COLUMNS($V$152:AJ153))","v":{"$error":"#NUM!"}},{"$f":"INDEX($T$8:$AM$112,SMALL(IF(COUNTIF($T$5,$T$8:$AM$112),MATCH(ROW($T$8:$AM$112),ROW($T$8:$AM$112)),\"\"),ROWS($V$152:AK153)),COLUMNS($V$152:AK153))","v":{"$error":"#NUM!"}},{"$f":"INDEX($T$8:$AM$112,SMALL(IF(COUNTIF($T$5,$T$8:$AM$112),MATCH(ROW($T$8:$AM$112),ROW($T$8:$AM$112)),\"\"),ROWS($V$152:AL153)),COLUMNS($V$152:AL153))","v":{"$error":"#NUM!"}},{"$f":"INDEX($T$8:$AM$112,SMALL(IF(COUNTIF($T$5,$T$8:$AM$112),MATCH(ROW($T$8:$AM$112),ROW($T$8:$AM$112)),\"\"),ROWS($V$152:AM153)),COLUMNS($V$152:AM153))","v":{"$error":"#NUM!"}},{"$f":"INDEX($T$8:$AM$112,SMALL(IF(COUNTIF($T$5,$T$8:$AM$112),MATCH(ROW($T$8:$AM$112),ROW($T$8:$AM$112)),\"\"),ROWS($V$152:AN153)),COLUMNS($V$152:AN153))","v":{"$error":"#NUM!"}},{"$f":"INDEX($T$8:$AM$112,SMALL(IF(COUNTIF($T$5,$T$8:$AM$112),MATCH(ROW($T$8:$AM$112),ROW($T$8:$AM$112)),\"\"),ROWS($V$152:AO153)),COLUMNS($V$152:AO153))","v":{"$error":"#NUM!"}}]
["",null,"",null,"$",null,null,null,null,null,null,null,null,null,null,{"$f":"IFERROR(AJ150,\"$\")","v":"$"},null,null,null,{"$f":"INDEX($T$8:$AM$112,SMALL(IF(COUNTIF($T$5,$T$8:$AM$112),MATCH(ROW($T$8:$AM$112),ROW($T$8:$AM$112)),\"\"),ROWS(V$152:$V154)),COLUMNS(V$152:$V154))","v":{"$error":"#NUM!"}},{"$f":"INDEX($T$8:$AM$112,SMALL(IF(COUNTIF($T$5,$T$8:$AM$112),MATCH(ROW($T$8:$AM$112),ROW($T$8:$AM$112)),\"\"),ROWS($V$152:W154)),COLUMNS($V$152:W154))","v":{"$error":"#NUM!"}},{"$f":"INDEX($T$8:$AM$112,SMALL(IF(COUNTIF($T$5,$T$8:$AM$112),MATCH(ROW($T$8:$AM$112),ROW($T$8:$AM$112)),\"\"),ROWS($V$152:X154)),COLUMNS($V$152:X154))","v":{"$error":"#NUM!"}},{"$f":"INDEX($T$8:$AM$112,SMALL(IF(COUNTIF($T$5,$T$8:$AM$112),MATCH(ROW($T$8:$AM$112),ROW($T$8:$AM$112)),\"\"),ROWS($V$152:Y154)),COLUMNS($V$152:Y154))","v":{"$error":"#NUM!"}},{"$f":"INDEX($T$8:$AM$112,SMALL(IF(COUNTIF($T$5,$T$8:$AM$112),MATCH(ROW($T$8:$AM$112),ROW($T$8:$AM$112)),\"\"),ROWS($V$152:Z154)),COLUMNS($V$152:Z154))","v":{"$error":"#NUM!"}},{"$f":"INDEX($T$8:$AM$112,SMALL(IF(COUNTIF($T$5,$T$8:$AM$112),MATCH(ROW($T$8:$AM$112),ROW($T$8:$AM$112)),\"\"),ROWS($V$152:AA154)),COLUMNS($V$152:AA154))","v":{"$error":"#NUM!"}},{"$f":"INDEX($T$8:$AM$112,SMALL(IF(COUNTIF($T$5,$T$8:$AM$112),MATCH(ROW($T$8:$AM$112),ROW($T$8:$AM$112)),\"\"),ROWS($V$152:AB154)),COLUMNS($V$152:AB154))","v":{"$error":"#NUM!"}},{"$f":"INDEX($T$8:$AM$112,SMALL(IF(COUNTIF($T$5,$T$8:$AM$112),MATCH(ROW($T$8:$AM$112),ROW($T$8:$AM$112)),\"\"),ROWS($V$152:AC154)),COLUMNS($V$152:AC154))","v":{"$error":"#NUM!"}},{"$f":"INDEX($T$8:$AM$112,SMALL(IF(COUNTIF($T$5,$T$8:$AM$112),MATCH(ROW($T$8:$AM$112),ROW($T$8:$AM$112)),\"\"),ROWS($V$152:AD154)),COLUMNS($V$152:AD154))","v":{"$error":"#NUM!"}},{"$f":"INDEX($T$8:$AM$112,SMALL(IF(COUNTIF($T$5,$T$8:$AM$112),MATCH(ROW($T$8:$AM$112),ROW($T$8:$AM$112)),\"\"),ROWS($V$152:AE154)),COLUMNS($V$152:AE154))","v":{"$error":"#NUM!"}},{"$f":"INDEX($T$8:$AM$112,SMALL(IF(COUNTIF($T$5,$T$8:$AM$112),MATCH(ROW($T$8:$AM$112),ROW($T$8:$AM$112)),\"\"),ROWS($V$152:AF154)),COLUMNS($V$152:AF154))","v":{"$error":"#NUM!"}},{"$f":"INDEX($T$8:$AM$112,SMALL(IF(COUNTIF($T$5,$T$8:$AM$112),MATCH(ROW($T$8:$AM$112),ROW($T$8:$AM$112)),\"\"),ROWS($V$152:AG154)),COLUMNS($V$152:AG154))","v":{"$error":"#NUM!"}},{"$f":"INDEX($T$8:$AM$112,SMALL(IF(COUNTIF($T$5,$T$8:$AM$112),MATCH(ROW($T$8:$AM$112),ROW($T$8:$AM$112)),\"\"),ROWS($V$152:AH154)),COLUMNS($V$152:AH154))","v":{"$error":"#NUM!"}},{"$f":"INDEX($T$8:$AM$112,SMALL(IF(COUNTIF($T$5,$T$8:$AM$112),MATCH(ROW($T$8:$AM$112),ROW($T$8:$AM$112)),\"\"),ROWS($V$152:AI154)),COLUMNS($V$152:AI154))","v":{"$error":"#NUM!"}},{"$f":"INDEX($T$8:$AM$112,SMALL(IF(COUNTIF($T$5,$T$8:$AM$112),MATCH(ROW($T$8:$AM$112),ROW($T$8:$AM$112)),\"\"),ROWS($V$152:AJ154)),COLUMNS($V$152:AJ154))","v":{"$error":"#NUM!"}},{"$f":"INDEX($T$8:$AM$112,SMALL(IF(COUNTIF($T$5,$T$8:$AM$112),MATCH(ROW($T$8:$AM$112),ROW($T$8:$AM$112)),\"\"),ROWS($V$152:AK154)),COLUMNS($V$152:AK154))","v":{"$error":"#NUM!"}},{"$f":"INDEX($T$8:$AM$112,SMALL(IF(COUNTIF($T$5,$T$8:$AM$112),MATCH(ROW($T$8:$AM$112),ROW($T$8:$AM$112)),\"\"),ROWS($V$152:AL154)),COLUMNS($V$152:AL154))","v":{"$error":"#NUM!"}},{"$f":"INDEX($T$8:$AM$112,SMALL(IF(COUNTIF($T$5,$T$8:$AM$112),MATCH(ROW($T$8:$AM$112),ROW($T$8:$AM$112)),\"\"),ROWS($V$152:AM154)),COLUMNS($V$152:AM154))","v":{"$error":"#NUM!"}},{"$f":"INDEX($T$8:$AM$112,SMALL(IF(COUNTIF($T$5,$T$8:$AM$112),MATCH(ROW($T$8:$AM$112),ROW($T$8:$AM$112)),\"\"),ROWS($V$152:AN154)),COLUMNS($V$152:AN154))","v":{"$error":"#NUM!"}},{"$f":"INDEX($T$8:$AM$112,SMALL(IF(COUNTIF($T$5,$T$8:$AM$112),MATCH(ROW($T$8:$AM$112),ROW($T$8:$AM$112)),\"\"),ROWS($V$152:AO154)),COLUMNS($V$152:AO154))","v":{"$error":"#NUM!"}}]
["",null,"",null,"$",null,null,null,null,null,null,null,null,null,null,"$",null,null,null,{"$f":"INDEX($T$8:$AM$112,SMALL(IF(COUNTIF($T$5,$T$8:$AM$112),MATCH(ROW($T$8:$AM$112),ROW($T$8:$AM$112)),\"\"),ROWS(V$152:$V155)),COLUMNS(V$152:$V155))","v":{"$error":"#NUM!"}},{"$f":"INDEX($T$8:$AM$112,SMALL(IF(COUNTIF($T$5,$T$8:$AM$112),MATCH(ROW($T$8:$AM$112),ROW($T$8:$AM$112)),\"\"),ROWS($V$152:W155)),COLUMNS($V$152:W155))","v":{"$error":"#NUM!"}},{"$f":"INDEX($T$8:$AM$112,SMALL(IF(COUNTIF($T$5,$T$8:$AM$112),MATCH(ROW($T$8:$AM$112),ROW($T$8:$AM$112)),\"\"),ROWS($V$152:X155)),COLUMNS($V$152:X155))","v":{"$error":"#NUM!"}},{"$f":"INDEX($T$8:$AM$112,SMALL(IF(COUNTIF($T$5,$T$8:$AM$112),MATCH(ROW($T$8:$AM$112),ROW($T$8:$AM$112)),\"\"),ROWS($V$152:Y155)),COLUMNS($V$152:Y155))","v":{"$error":"#NUM!"}},{"$f":"INDEX($T$8:$AM$112,SMALL(IF(COUNTIF($T$5,$T$8:$AM$112),MATCH(ROW($T$8:$AM$112),ROW($T$8:$AM$112)),\"\"),ROWS($V$152:Z155)),COLUMNS($V$152:Z155))","v":{"$error":"#NUM!"}},{"$f":"INDEX($T$8:$AM$112,SMALL(IF(COUNTIF($T$5,$T$8:$AM$112),MATCH(ROW($T$8:$AM$112),ROW($T$8:$AM$112)),\"\"),ROWS($V$152:AA155)),COLUMNS($V$152:AA155))","v":{"$error":"#NUM!"}},{"$f":"INDEX($T$8:$AM$112,SMALL(IF(COUNTIF($T$5,$T$8:$AM$112),MATCH(ROW($T$8:$AM$112),ROW($T$8:$AM$112)),\"\"),ROWS($V$152:AB155)),COLUMNS($V$152:AB155))","v":{"$error":"#NUM!"}},{"$f":"INDEX($T$8:$AM$112,SMALL(IF(COUNTIF($T$5,$T$8:$AM$112),MATCH(ROW($T$8:$AM$112),ROW($T$8:$AM$112)),\"\"),ROWS($V$152:AC155)),COLUMNS($V$152:AC155))","v":{"$error":"#NUM!"}},{"$f":"INDEX($T$8:$AM$112,SMALL(IF(COUNTIF($T$5,$T$8:$AM$112),MATCH(ROW($T$8:$AM$112),ROW($T$8:$AM$112)),\"\"),ROWS($V$152:AD155)),COLUMNS($V$152:AD155))","v":{"$error":"#NUM!"}},{"$f":"INDEX($T$8:$AM$112,SMALL(IF(COUNTIF($T$5,$T$8:$AM$112),MATCH(ROW($T$8:$AM$112),ROW($T$8:$AM$112)),\"\"),ROWS($V$152:AE155)),COLUMNS($V$152:AE155))","v":{"$error":"#NUM!"}},{"$f":"INDEX($T$8:$AM$112,SMALL(IF(COUNTIF($T$5,$T$8:$AM$112),MATCH(ROW($T$8:$AM$112),ROW($T$8:$AM$112)),\"\"),ROWS($V$152:AF155)),COLUMNS($V$152:AF155))","v":{"$error":"#NUM!"}},{"$f":"INDEX($T$8:$AM$112,SMALL(IF(COUNTIF($T$5,$T$8:$AM$112),MATCH(ROW($T$8:$AM$112),ROW($T$8:$AM$112)),\"\"),ROWS($V$152:AG155)),COLUMNS($V$152:AG155))","v":{"$error":"#NUM!"}},{"$f":"INDEX($T$8:$AM$112,SMALL(IF(COUNTIF($T$5,$T$8:$AM$112),MATCH(ROW($T$8:$AM$112),ROW($T$8:$AM$112)),\"\"),ROWS($V$152:AH155)),COLUMNS($V$152:AH155))","v":{"$error":"#NUM!"}},{"$f":"INDEX($T$8:$AM$112,SMALL(IF(COUNTIF($T$5,$T$8:$AM$112),MATCH(ROW($T$8:$AM$112),ROW($T$8:$AM$112)),\"\"),ROWS($V$152:AI155)),COLUMNS($V$152:AI155))","v":{"$error":"#NUM!"}},{"$f":"INDEX($T$8:$AM$112,SMALL(IF(COUNTIF($T$5,$T$8:$AM$112),MATCH(ROW($T$8:$AM$112),ROW($T$8:$AM$112)),\"\"),ROWS($V$152:AJ155)),COLUMNS($V$152:AJ155))","v":{"$error":"#NUM!"}},{"$f":"INDEX($T$8:$AM$112,SMALL(IF(COUNTIF($T$5,$T$8:$AM$112),MATCH(ROW($T$8:$AM$112),ROW($T$8:$AM$112)),\"\"),ROWS($V$152:AK155)),COLUMNS($V$152:AK155))","v":{"$error":"#NUM!"}},{"$f":"INDEX($T$8:$AM$112,SMALL(IF(COUNTIF($T$5,$T$8:$AM$112),MATCH(ROW($T$8:$AM$112),ROW($T$8:$AM$112)),\"\"),ROWS($V$152:AL155)),COLUMNS($V$152:AL155))","v":{"$error":"#NUM!"}},{"$f":"INDEX($T$8:$AM$112,SMALL(IF(COUNTIF($T$5,$T$8:$AM$112),MATCH(ROW($T$8:$AM$112),ROW($T$8:$AM$112)),\"\"),ROWS($V$152:AM155)),COLUMNS($V$152:AM155))","v":{"$error":"#NUM!"}},{"$f":"INDEX($T$8:$AM$112,SMALL(IF(COUNTIF($T$5,$T$8:$AM$112),MATCH(ROW($T$8:$AM$112),ROW($T$8:$AM$112)),\"\"),ROWS($V$152:AN155)),COLUMNS($V$152:AN155))","v":{"$error":"#NUM!"}},{"$f":"INDEX($T$8:$AM$112,SMALL(IF(COUNTIF($T$5,$T$8:$AM$112),MATCH(ROW($T$8:$AM$112),ROW($T$8:$AM$112)),\"\"),ROWS($V$152:AO155)),COLUMNS($V$152:AO155))","v":{"$error":"#NUM!"}}]
["",null,"",null,"$",null,null,null,null,null,null,null,null,null,null,"$",null,null,null,{"$f":"INDEX($T$8:$AM$112,SMALL(IF(COUNTIF($T$5,$T$8:$AM$112),MATCH(ROW($T$8:$AM$112),ROW($T$8:$AM$112)),\"\"),ROWS(V$152:$V156)),COLUMNS(V$152:$V156))","v":{"$error":"#NUM!"}},{"$f":"INDEX($T$8:$AM$112,SMALL(IF(COUNTIF($T$5,$T$8:$AM$112),MATCH(ROW($T$8:$AM$112),ROW($T$8:$AM$112)),\"\"),ROWS($V$152:W156)),COLUMNS($V$152:W156))","v":{"$error":"#NUM!"}},{"$f":"INDEX($T$8:$AM$112,SMALL(IF(COUNTIF($T$5,$T$8:$AM$112),MATCH(ROW($T$8:$AM$112),ROW($T$8:$AM$112)),\"\"),ROWS($V$152:X156)),COLUMNS($V$152:X156))","v":{"$error":"#NUM!"}},{"$f":"INDEX($T$8:$AM$112,SMALL(IF(COUNTIF($T$5,$T$8:$AM$112),MATCH(ROW($T$8:$AM$112),ROW($T$8:$AM$112)),\"\"),ROWS($V$152:Y156)),COLUMNS($V$152:Y156))","v":{"$error":"#NUM!"}},{"$f":"INDEX($T$8:$AM$112,SMALL(IF(COUNTIF($T$5,$T$8:$AM$112),MATCH(ROW($T$8:$AM$112),ROW($T$8:$AM$112)),\"\"),ROWS($V$152:Z156)),COLUMNS($V$152:Z156))","v":{"$error":"#NUM!"}},{"$f":"INDEX($T$8:$AM$112,SMALL(IF(COUNTIF($T$5,$T$8:$AM$112),MATCH(ROW($T$8:$AM$112),ROW($T$8:$AM$112)),\"\"),ROWS($V$152:AA156)),COLUMNS($V$152:AA156))","v":{"$error":"#NUM!"}},{"$f":"INDEX($T$8:$AM$112,SMALL(IF(COUNTIF($T$5,$T$8:$AM$112),MATCH(ROW($T$8:$AM$112),ROW($T$8:$AM$112)),\"\"),ROWS($V$152:AB156)),COLUMNS($V$152:AB156))","v":{"$error":"#NUM!"}},{"$f":"INDEX($T$8:$AM$112,SMALL(IF(COUNTIF($T$5,$T$8:$AM$112),MATCH(ROW($T$8:$AM$112),ROW($T$8:$AM$112)),\"\"),ROWS($V$152:AC156)),COLUMNS($V$152:AC156))","v":{"$error":"#NUM!"}},{"$f":"INDEX($T$8:$AM$112,SMALL(IF(COUNTIF($T$5,$T$8:$AM$112),MATCH(ROW($T$8:$AM$112),ROW($T$8:$AM$112)),\"\"),ROWS($V$152:AD156)),COLUMNS($V$152:AD156))","v":{"$error":"#NUM!"}},{"$f":"INDEX($T$8:$AM$112,SMALL(IF(COUNTIF($T$5,$T$8:$AM$112),MATCH(ROW($T$8:$AM$112),ROW($T$8:$AM$112)),\"\"),ROWS($V$152:AE156)),COLUMNS($V$152:AE156))","v":{"$error":"#NUM!"}},{"$f":"INDEX($T$8:$AM$112,SMALL(IF(COUNTIF($T$5,$T$8:$AM$112),MATCH(ROW($T$8:$AM$112),ROW($T$8:$AM$112)),\"\"),ROWS($V$152:AF156)),COLUMNS($V$152:AF156))","v":{"$error":"#NUM!"}},{"$f":"INDEX($T$8:$AM$112,SMALL(IF(COUNTIF($T$5,$T$8:$AM$112),MATCH(ROW($T$8:$AM$112),ROW($T$8:$AM$112)),\"\"),ROWS($V$152:AG156)),COLUMNS($V$152:AG156))","v":{"$error":"#NUM!"}},{"$f":"INDEX($T$8:$AM$112,SMALL(IF(COUNTIF($T$5,$T$8:$AM$112),MATCH(ROW($T$8:$AM$112),ROW($T$8:$AM$112)),\"\"),ROWS($V$152:AH156)),COLUMNS($V$152:AH156))","v":{"$error":"#NUM!"}},{"$f":"INDEX($T$8:$AM$112,SMALL(IF(COUNTIF($T$5,$T$8:$AM$112),MATCH(ROW($T$8:$AM$112),ROW($T$8:$AM$112)),\"\"),ROWS($V$152:AI156)),COLUMNS($V$152:AI156))","v":{"$error":"#NUM!"}},{"$f":"INDEX($T$8:$AM$112,SMALL(IF(COUNTIF($T$5,$T$8:$AM$112),MATCH(ROW($T$8:$AM$112),ROW($T$8:$AM$112)),\"\"),ROWS($V$152:AJ156)),COLUMNS($V$152:AJ156))","v":{"$error":"#NUM!"}},{"$f":"INDEX($T$8:$AM$112,SMALL(IF(COUNTIF($T$5,$T$8:$AM$112),MATCH(ROW($T$8:$AM$112),ROW($T$8:$AM$112)),\"\"),ROWS($V$152:AK156)),COLUMNS($V$152:AK156))","v":{"$error":"#NUM!"}},{"$f":"INDEX($T$8:$AM$112,SMALL(IF(COUNTIF($T$5,$T$8:$AM$112),MATCH(ROW($T$8:$AM$112),ROW($T$8:$AM$112)),\"\"),ROWS($V$152:AL156)),COLUMNS($V$152:AL156))","v":{"$error":"#NUM!"}},{"$f":"INDEX($T$8:$AM$112,SMALL(IF(COUNTIF($T$5,$T$8:$AM$112),MATCH(ROW($T$8:$AM$112),ROW($T$8:$AM$112)),\"\"),ROWS($V$152:AM156)),COLUMNS($V$152:AM156))","v":{"$error":"#NUM!"}},{"$f":"INDEX($T$8:$AM$112,SMALL(IF(COUNTIF($T$5,$T$8:$AM$112),MATCH(ROW($T$8:$AM$112),ROW($T$8:$AM$112)),\"\"),ROWS($V$152:AN156)),COLUMNS($V$152:AN156))","v":{"$error":"#NUM!"}},{"$f":"INDEX($T$8:$AM$112,SMALL(IF(COUNTIF($T$5,$T$8:$AM$112),MATCH(ROW($T$8:$AM$112),ROW($T$8:$AM$112)),\"\"),ROWS($V$152:AO156)),COLUMNS($V$152:AO156))","v":{"$error":"#NUM!"}}]
["",null,"",null,"$",null,null,null,null,null,null,null,null,null,null,"$",null,null,null,{"$f":"INDEX($T$8:$AM$112,SMALL(IF(COUNTIF($T$5,$T$8:$AM$112),MATCH(ROW($T$8:$AM$112),ROW($T$8:$AM$112)),\"\"),ROWS(V$152:$V157)),COLUMNS(V$152:$V157))","v":{"$error":"#NUM!"}},{"$f":"INDEX($T$8:$AM$112,SMALL(IF(COUNTIF($T$5,$T$8:$AM$112),MATCH(ROW($T$8:$AM$112),ROW($T$8:$AM$112)),\"\"),ROWS($V$152:W157)),COLUMNS($V$152:W157))","v":{"$error":"#NUM!"}},{"$f":"INDEX($T$8:$AM$112,SMALL(IF(COUNTIF($T$5,$T$8:$AM$112),MATCH(ROW($T$8:$AM$112),ROW($T$8:$AM$112)),\"\"),ROWS($V$152:X157)),COLUMNS($V$152:X157))","v":{"$error":"#NUM!"}},{"$f":"INDEX($T$8:$AM$112,SMALL(IF(COUNTIF($T$5,$T$8:$AM$112),MATCH(ROW($T$8:$AM$112),ROW($T$8:$AM$112)),\"\"),ROWS($V$152:Y157)),COLUMNS($V$152:Y157))","v":{"$error":"#NUM!"}},{"$f":"INDEX($T$8:$AM$112,SMALL(IF(COUNTIF($T$5,$T$8:$AM$112),MATCH(ROW($T$8:$AM$112),ROW($T$8:$AM$112)),\"\"),ROWS($V$152:Z157)),COLUMNS($V$152:Z157))","v":{"$error":"#NUM!"}},{"$f":"INDEX($T$8:$AM$112,SMALL(IF(COUNTIF($T$5,$T$8:$AM$112),MATCH(ROW($T$8:$AM$112),ROW($T$8:$AM$112)),\"\"),ROWS($V$152:AA157)),COLUMNS($V$152:AA157))","v":{"$error":"#NUM!"}},{"$f":"INDEX($T$8:$AM$112,SMALL(IF(COUNTIF($T$5,$T$8:$AM$112),MATCH(ROW($T$8:$AM$112),ROW($T$8:$AM$112)),\"\"),ROWS($V$152:AB157)),COLUMNS($V$152:AB157))","v":{"$error":"#NUM!"}},{"$f":"INDEX($T$8:$AM$112,SMALL(IF(COUNTIF($T$5,$T$8:$AM$112),MATCH(ROW($T$8:$AM$112),ROW($T$8:$AM$112)),\"\"),ROWS($V$152:AC157)),COLUMNS($V$152:AC157))","v":{"$error":"#NUM!"}},{"$f":"INDEX($T$8:$AM$112,SMALL(IF(COUNTIF($T$5,$T$8:$AM$112),MATCH(ROW($T$8:$AM$112),ROW($T$8:$AM$112)),\"\"),ROWS($V$152:AD157)),COLUMNS($V$152:AD157))","v":{"$error":"#NUM!"}},{"$f":"INDEX($T$8:$AM$112,SMALL(IF(COUNTIF($T$5,$T$8:$AM$112),MATCH(ROW($T$8:$AM$112),ROW($T$8:$AM$112)),\"\"),ROWS($V$152:AE157)),COLUMNS($V$152:AE157))","v":{"$error":"#NUM!"}},{"$f":"INDEX($T$8:$AM$112,SMALL(IF(COUNTIF($T$5,$T$8:$AM$112),MATCH(ROW($T$8:$AM$112),ROW($T$8:$AM$112)),\"\"),ROWS($V$152:AF157)),COLUMNS($V$152:AF157))","v":{"$error":"#NUM!"}},{"$f":"INDEX($T$8:$AM$112,SMALL(IF(COUNTIF($T$5,$T$8:$AM$112),MATCH(ROW($T$8:$AM$112),ROW($T$8:$AM$112)),\"\"),ROWS($V$152:AG157)),COLUMNS($V$152:AG157))","v":{"$error":"#NUM!"}},{"$f":"INDEX($T$8:$AM$112,SMALL(IF(COUNTIF($T$5,$T$8:$AM$112),MATCH(ROW($T$8:$AM$112),ROW($T$8:$AM$112)),\"\"),ROWS($V$152:AH157)),COLUMNS($V$152:AH157))","v":{"$error":"#NUM!"}},{"$f":"INDEX($T$8:$AM$112,SMALL(IF(COUNTIF($T$5,$T$8:$AM$112),MATCH(ROW($T$8:$AM$112),ROW($T$8:$AM$112)),\"\"),ROWS($V$152:AI157)),COLUMNS($V$152:AI157))","v":{"$error":"#NUM!"}},{"$f":"INDEX($T$8:$AM$112,SMALL(IF(COUNTIF($T$5,$T$8:$AM$112),MATCH(ROW($T$8:$AM$112),ROW($T$8:$AM$112)),\"\"),ROWS($V$152:AJ157)),COLUMNS($V$152:AJ157))","v":{"$error":"#NUM!"}},{"$f":"INDEX($T$8:$AM$112,SMALL(IF(COUNTIF($T$5,$T$8:$AM$112),MATCH(ROW($T$8:$AM$112),ROW($T$8:$AM$112)),\"\"),ROWS($V$152:AK157)),COLUMNS($V$152:AK157))","v":{"$error":"#NUM!"}},{"$f":"INDEX($T$8:$AM$112,SMALL(IF(COUNTIF($T$5,$T$8:$AM$112),MATCH(ROW($T$8:$AM$112),ROW($T$8:$AM$112)),\"\"),ROWS($V$152:AL157)),COLUMNS($V$152:AL157))","v":{"$error":"#NUM!"}},{"$f":"INDEX($T$8:$AM$112,SMALL(IF(COUNTIF($T$5,$T$8:$AM$112),MATCH(ROW($T$8:$AM$112),ROW($T$8:$AM$112)),\"\"),ROWS($V$152:AM157)),COLUMNS($V$152:AM157))","v":{"$error":"#NUM!"}},{"$f":"INDEX($T$8:$AM$112,SMALL(IF(COUNTIF($T$5,$T$8:$AM$112),MATCH(ROW($T$8:$AM$112),ROW($T$8:$AM$112)),\"\"),ROWS($V$152:AN157)),COLUMNS($V$152:AN157))","v":{"$error":"#NUM!"}},{"$f":"INDEX($T$8:$AM$112,SMALL(IF(COUNTIF($T$5,$T$8:$AM$112),MATCH(ROW($T$8:$AM$112),ROW($T$8:$AM$112)),\"\"),ROWS($V$152:AO157)),COLUMNS($V$152:AO157))","v":{"$error":"#NUM!"}}]
["",null,"",null,"$",null,null,null,null,null,null,null,null,null,null,"$",null,null,null,{"$f":"INDEX($T$8:$AM$112,SMALL(IF(COUNTIF($T$5,$T$8:$AM$112),MATCH(ROW($T$8:$AM$112),ROW($T$8:$AM$112)),\"\"),ROWS(V$152:$V158)),COLUMNS(V$152:$V158))","v":{"$error":"#NUM!"}},{"$f":"INDEX($T$8:$AM$112,SMALL(IF(COUNTIF($T$5,$T$8:$AM$112),MATCH(ROW($T$8:$AM$112),ROW($T$8:$AM$112)),\"\"),ROWS($V$152:W158)),COLUMNS($V$152:W158))","v":{"$error":"#NUM!"}},{"$f":"INDEX($T$8:$AM$112,SMALL(IF(COUNTIF($T$5,$T$8:$AM$112),MATCH(ROW($T$8:$AM$112),ROW($T$8:$AM$112)),\"\"),ROWS($V$152:X158)),COLUMNS($V$152:X158))","v":{"$error":"#NUM!"}},{"$f":"INDEX($T$8:$AM$112,SMALL(IF(COUNTIF($T$5,$T$8:$AM$112),MATCH(ROW($T$8:$AM$112),ROW($T$8:$AM$112)),\"\"),ROWS($V$152:Y158)),COLUMNS($V$152:Y158))","v":{"$error":"#NUM!"}},{"$f":"INDEX($T$8:$AM$112,SMALL(IF(COUNTIF($T$5,$T$8:$AM$112),MATCH(ROW($T$8:$AM$112),ROW($T$8:$AM$112)),\"\"),ROWS($V$152:Z158)),COLUMNS($V$152:Z158))","v":{"$error":"#NUM!"}},{"$f":"INDEX($T$8:$AM$112,SMALL(IF(COUNTIF($T$5,$T$8:$AM$112),MATCH(ROW($T$8:$AM$112),ROW($T$8:$AM$112)),\"\"),ROWS($V$152:AA158)),COLUMNS($V$152:AA158))","v":{"$error":"#NUM!"}},{"$f":"INDEX($T$8:$AM$112,SMALL(IF(COUNTIF($T$5,$T$8:$AM$112),MATCH(ROW($T$8:$AM$112),ROW($T$8:$AM$112)),\"\"),ROWS($V$152:AB158)),COLUMNS($V$152:AB158))","v":{"$error":"#NUM!"}},{"$f":"INDEX($T$8:$AM$112,SMALL(IF(COUNTIF($T$5,$T$8:$AM$112),MATCH(ROW($T$8:$AM$112),ROW($T$8:$AM$112)),\"\"),ROWS($V$152:AC158)),COLUMNS($V$152:AC158))","v":{"$error":"#NUM!"}},{"$f":"INDEX($T$8:$AM$112,SMALL(IF(COUNTIF($T$5,$T$8:$AM$112),MATCH(ROW($T$8:$AM$112),ROW($T$8:$AM$112)),\"\"),ROWS($V$152:AD158)),COLUMNS($V$152:AD158))","v":{"$error":"#NUM!"}},{"$f":"INDEX($T$8:$AM$112,SMALL(IF(COUNTIF($T$5,$T$8:$AM$112),MATCH(ROW($T$8:$AM$112),ROW($T$8:$AM$112)),\"\"),ROWS($V$152:AE158)),COLUMNS($V$152:AE158))","v":{"$error":"#NUM!"}},{"$f":"INDEX($T$8:$AM$112,SMALL(IF(COUNTIF($T$5,$T$8:$AM$112),MATCH(ROW($T$8:$AM$112),ROW($T$8:$AM$112)),\"\"),ROWS($V$152:AF158)),COLUMNS($V$152:AF158))","v":{"$error":"#NUM!"}},{"$f":"INDEX($T$8:$AM$112,SMALL(IF(COUNTIF($T$5,$T$8:$AM$112),MATCH(ROW($T$8:$AM$112),ROW($T$8:$AM$112)),\"\"),ROWS($V$152:AG158)),COLUMNS($V$152:AG158))","v":{"$error":"#NUM!"}},{"$f":"INDEX($T$8:$AM$112,SMALL(IF(COUNTIF($T$5,$T$8:$AM$112),MATCH(ROW($T$8:$AM$112),ROW($T$8:$AM$112)),\"\"),ROWS($V$152:AH158)),COLUMNS($V$152:AH158))","v":{"$error":"#NUM!"}},{"$f":"INDEX($T$8:$AM$112,SMALL(IF(COUNTIF($T$5,$T$8:$AM$112),MATCH(ROW($T$8:$AM$112),ROW($T$8:$AM$112)),\"\"),ROWS($V$152:AI158)),COLUMNS($V$152:AI158))","v":{"$error":"#NUM!"}},{"$f":"INDEX($T$8:$AM$112,SMALL(IF(COUNTIF($T$5,$T$8:$AM$112),MATCH(ROW($T$8:$AM$112),ROW($T$8:$AM$112)),\"\"),ROWS($V$152:AJ158)),COLUMNS($V$152:AJ158))","v":{"$error":"#NUM!"}},{"$f":"INDEX($T$8:$AM$112,SMALL(IF(COUNTIF($T$5,$T$8:$AM$112),MATCH(ROW($T$8:$AM$112),ROW($T$8:$AM$112)),\"\"),ROWS($V$152:AK158)),COLUMNS($V$152:AK158))","v":{"$error":"#NUM!"}},{"$f":"INDEX($T$8:$AM$112,SMALL(IF(COUNTIF($T$5,$T$8:$AM$112),MATCH(ROW($T$8:$AM$112),ROW($T$8:$AM$112)),\"\"),ROWS($V$152:AL158)),COLUMNS($V$152:AL158))","v":{"$error":"#NUM!"}},{"$f":"INDEX($T$8:$AM$112,SMALL(IF(COUNTIF($T$5,$T$8:$AM$112),MATCH(ROW($T$8:$AM$112),ROW($T$8:$AM$112)),\"\"),ROWS($V$152:AM158)),COLUMNS($V$152:AM158))","v":{"$error":"#NUM!"}},{"$f":"INDEX($T$8:$AM$112,SMALL(IF(COUNTIF($T$5,$T$8:$AM$112),MATCH(ROW($T$8:$AM$112),ROW($T$8:$AM$112)),\"\"),ROWS($V$152:AN158)),COLUMNS($V$152:AN158))","v":{"$error":"#NUM!"}},{"$f":"INDEX($T$8:$AM$112,SMALL(IF(COUNTIF($T$5,$T$8:$AM$112),MATCH(ROW($T$8:$AM$112),ROW($T$8:$AM$112)),\"\"),ROWS($V$152:AO158)),COLUMNS($V$152:AO158))","v":{"$error":"#NUM!"}}]
["",null,"",null,"$",null,null,null,null,null,null,null,null,null,null,"$",null,null,null,{"$f":"INDEX($T$8:$AM$112,SMALL(IF(COUNTIF($T$5,$T$8:$AM$112),MATCH(ROW($T$8:$AM$112),ROW($T$8:$AM$112)),\"\"),ROWS(V$152:$V159)),COLUMNS(V$152:$V159))","v":{"$error":"#NUM!"}},{"$f":"INDEX($T$8:$AM$112,SMALL(IF(COUNTIF($T$5,$T$8:$AM$112),MATCH(ROW($T$8:$AM$112),ROW($T$8:$AM$112)),\"\"),ROWS($V$152:W159)),COLUMNS($V$152:W159))","v":{"$error":"#NUM!"}},{"$f":"INDEX($T$8:$AM$112,SMALL(IF(COUNTIF($T$5,$T$8:$AM$112),MATCH(ROW($T$8:$AM$112),ROW($T$8:$AM$112)),\"\"),ROWS($V$152:X159)),COLUMNS($V$152:X159))","v":{"$error":"#NUM!"}},{"$f":"INDEX($T$8:$AM$112,SMALL(IF(COUNTIF($T$5,$T$8:$AM$112),MATCH(ROW($T$8:$AM$112),ROW($T$8:$AM$112)),\"\"),ROWS($V$152:Y159)),COLUMNS($V$152:Y159))","v":{"$error":"#NUM!"}},{"$f":"INDEX($T$8:$AM$112,SMALL(IF(COUNTIF($T$5,$T$8:$AM$112),MATCH(ROW($T$8:$AM$112),ROW($T$8:$AM$112)),\"\"),ROWS($V$152:Z159)),COLUMNS($V$152:Z159))","v":{"$error":"#NUM!"}},{"$f":"INDEX($T$8:$AM$112,SMALL(IF(COUNTIF($T$5,$T$8:$AM$112),MATCH(ROW($T$8:$AM$112),ROW($T$8:$AM$112)),\"\"),ROWS($V$152:AA159)),COLUMNS($V$152:AA159))","v":{"$error":"#NUM!"}},{"$f":"INDEX($T$8:$AM$112,SMALL(IF(COUNTIF($T$5,$T$8:$AM$112),MATCH(ROW($T$8:$AM$112),ROW($T$8:$AM$112)),\"\"),ROWS($V$152:AB159)),COLUMNS($V$152:AB159))","v":{"$error":"#NUM!"}},{"$f":"INDEX($T$8:$AM$112,SMALL(IF(COUNTIF($T$5,$T$8:$AM$112),MATCH(ROW($T$8:$AM$112),ROW($T$8:$AM$112)),\"\"),ROWS($V$152:AC159)),COLUMNS($V$152:AC159))","v":{"$error":"#NUM!"}},{"$f":"INDEX($T$8:$AM$112,SMALL(IF(COUNTIF($T$5,$T$8:$AM$112),MATCH(ROW($T$8:$AM$112),ROW($T$8:$AM$112)),\"\"),ROWS($V$152:AD159)),COLUMNS($V$152:AD159))","v":{"$error":"#NUM!"}},{"$f":"INDEX($T$8:$AM$112,SMALL(IF(COUNTIF($T$5,$T$8:$AM$112),MATCH(ROW($T$8:$AM$112),ROW($T$8:$AM$112)),\"\"),ROWS($V$152:AE159)),COLUMNS($V$152:AE159))","v":{"$error":"#NUM!"}},{"$f":"INDEX($T$8:$AM$112,SMALL(IF(COUNTIF($T$5,$T$8:$AM$112),MATCH(ROW($T$8:$AM$112),ROW($T$8:$AM$112)),\"\"),ROWS($V$152:AF159)),COLUMNS($V$152:AF159))","v":{"$error":"#NUM!"}},{"$f":"INDEX($T$8:$AM$112,SMALL(IF(COUNTIF($T$5,$T$8:$AM$112),MATCH(ROW($T$8:$AM$112),ROW($T$8:$AM$112)),\"\"),ROWS($V$152:AG159)),COLUMNS($V$152:AG159))","v":{"$error":"#NUM!"}},{"$f":"INDEX($T$8:$AM$112,SMALL(IF(COUNTIF($T$5,$T$8:$AM$112),MATCH(ROW($T$8:$AM$112),ROW($T$8:$AM$112)),\"\"),ROWS($V$152:AH159)),COLUMNS($V$152:AH159))","v":{"$error":"#NUM!"}},{"$f":"INDEX($T$8:$AM$112,SMALL(IF(COUNTIF($T$5,$T$8:$AM$112),MATCH(ROW($T$8:$AM$112),ROW($T$8:$AM$112)),\"\"),ROWS($V$152:AI159)),COLUMNS($V$152:AI159))","v":{"$error":"#NUM!"}},{"$f":"INDEX($T$8:$AM$112,SMALL(IF(COUNTIF($T$5,$T$8:$AM$112),MATCH(ROW($T$8:$AM$112),ROW($T$8:$AM$112)),\"\"),ROWS($V$152:AJ159)),COLUMNS($V$152:AJ159))","v":{"$error":"#NUM!"}},{"$f":"INDEX($T$8:$AM$112,SMALL(IF(COUNTIF($T$5,$T$8:$AM$112),MATCH(ROW($T$8:$AM$112),ROW($T$8:$AM$112)),\"\"),ROWS($V$152:AK159)),COLUMNS($V$152:AK159))","v":{"$error":"#NUM!"}},{"$f":"INDEX($T$8:$AM$112,SMALL(IF(COUNTIF($T$5,$T$8:$AM$112),MATCH(ROW($T$8:$AM$112),ROW($T$8:$AM$112)),\"\"),ROWS($V$152:AL159)),COLUMNS($V$152:AL159))","v":{"$error":"#NUM!"}},{"$f":"INDEX($T$8:$AM$112,SMALL(IF(COUNTIF($T$5,$T$8:$AM$112),MATCH(ROW($T$8:$AM$112),ROW($T$8:$AM$112)),\"\"),ROWS($V$152:AM159)),COLUMNS($V$152:AM159))","v":{"$error":"#NUM!"}},{"$f":"INDEX($T$8:$AM$112,SMALL(IF(COUNTIF($T$5,$T$8:$AM$112),MATCH(ROW($T$8:$AM$112),ROW($T$8:$AM$112)),\"\"),ROWS($V$152:AN159)),COLUMNS($V$152:AN159))","v":{"$error":"#NUM!"}},{"$f":"INDEX($T$8:$AM$112,SMALL(IF(COUNTIF($T$5,$T$8:$AM$112),MATCH(ROW($T$8:$AM$112),ROW($T$8:$AM$112)),\"\"),ROWS($V$152:AO159)),COLUMNS($V$152:AO159))","v":{"$error":"#NUM!"}}]
["",null,"",null,"$",null,null,null,null,null,null,null,null,null,null,"$",null,null,null,{"$f":"INDEX($T$8:$AM$112,SMALL(IF(COUNTIF($T$5,$T$8:$AM$112),MATCH(ROW($T$8:$AM$112),ROW($T$8:$AM$112)),\"\"),ROWS(V$152:$V160)),COLUMNS(V$152:$V160))","v":{"$error":"#NUM!"}},{"$f":"INDEX($T$8:$AM$112,SMALL(IF(COUNTIF($T$5,$T$8:$AM$112),MATCH(ROW($T$8:$AM$112),ROW($T$8:$AM$112)),\"\"),ROWS($V$152:W160)),COLUMNS($V$152:W160))","v":{"$error":"#NUM!"}},{"$f":"INDEX($T$8:$AM$112,SMALL(IF(COUNTIF($T$5,$T$8:$AM$112),MATCH(ROW($T$8:$AM$112),ROW($T$8:$AM$112)),\"\"),ROWS($V$152:X160)),COLUMNS($V$152:X160))","v":{"$error":"#NUM!"}},{"$f":"INDEX($T$8:$AM$112,SMALL(IF(COUNTIF($T$5,$T$8:$AM$112),MATCH(ROW($T$8:$AM$112),ROW($T$8:$AM$112)),\"\"),ROWS($V$152:Y160)),COLUMNS($V$152:Y160))","v":{"$error":"#NUM!"}},{"$f":"INDEX($T$8:$AM$112,SMALL(IF(COUNTIF($T$5,$T$8:$AM$112),MATCH(ROW($T$8:$AM$112),ROW($T$8:$AM$112)),\"\"),ROWS($V$152:Z160)),COLUMNS($V$152:Z160))","v":{"$error":"#NUM!"}},{"$f":"INDEX($T$8:$AM$112,SMALL(IF(COUNTIF($T$5,$T$8:$AM$112),MATCH(ROW($T$8:$AM$112),ROW($T$8:$AM$112)),\"\"),ROWS($V$152:AA160)),COLUMNS($V$152:AA160))","v":{"$error":"#NUM!"}},{"$f":"INDEX($T$8:$AM$112,SMALL(IF(COUNTIF($T$5,$T$8:$AM$112),MATCH(ROW($T$8:$AM$112),ROW($T$8:$AM$112)),\"\"),ROWS($V$152:AB160)),COLUMNS($V$152:AB160))","v":{"$error":"#NUM!"}},{"$f":"INDEX($T$8:$AM$112,SMALL(IF(COUNTIF($T$5,$T$8:$AM$112),MATCH(ROW($T$8:$AM$112),ROW($T$8:$AM$112)),\"\"),ROWS($V$152:AC160)),COLUMNS($V$152:AC160))","v":{"$error":"#NUM!"}},{"$f":"INDEX($T$8:$AM$112,SMALL(IF(COUNTIF($T$5,$T$8:$AM$112),MATCH(ROW($T$8:$AM$112),ROW($T$8:$AM$112)),\"\"),ROWS($V$152:AD160)),COLUMNS($V$152:AD160))","v":{"$error":"#NUM!"}},{"$f":"INDEX($T$8:$AM$112,SMALL(IF(COUNTIF($T$5,$T$8:$AM$112),MATCH(ROW($T$8:$AM$112),ROW($T$8:$AM$112)),\"\"),ROWS($V$152:AE160)),COLUMNS($V$152:AE160))","v":{"$error":"#NUM!"}},{"$f":"INDEX($T$8:$AM$112,SMALL(IF(COUNTIF($T$5,$T$8:$AM$112),MATCH(ROW($T$8:$AM$112),ROW($T$8:$AM$112)),\"\"),ROWS($V$152:AF160)),COLUMNS($V$152:AF160))","v":{"$error":"#NUM!"}},{"$f":"INDEX($T$8:$AM$112,SMALL(IF(COUNTIF($T$5,$T$8:$AM$112),MATCH(ROW($T$8:$AM$112),ROW($T$8:$AM$112)),\"\"),ROWS($V$152:AG160)),COLUMNS($V$152:AG160))","v":{"$error":"#NUM!"}},{"$f":"INDEX($T$8:$AM$112,SMALL(IF(COUNTIF($T$5,$T$8:$AM$112),MATCH(ROW($T$8:$AM$112),ROW($T$8:$AM$112)),\"\"),ROWS($V$152:AH160)),COLUMNS($V$152:AH160))","v":{"$error":"#NUM!"}},{"$f":"INDEX($T$8:$AM$112,SMALL(IF(COUNTIF($T$5,$T$8:$AM$112),MATCH(ROW($T$8:$AM$112),ROW($T$8:$AM$112)),\"\"),ROWS($V$152:AI160)),COLUMNS($V$152:AI160))","v":{"$error":"#NUM!"}},{"$f":"INDEX($T$8:$AM$112,SMALL(IF(COUNTIF($T$5,$T$8:$AM$112),MATCH(ROW($T$8:$AM$112),ROW($T$8:$AM$112)),\"\"),ROWS($V$152:AJ160)),COLUMNS($V$152:AJ160))","v":{"$error":"#NUM!"}},{"$f":"INDEX($T$8:$AM$112,SMALL(IF(COUNTIF($T$5,$T$8:$AM$112),MATCH(ROW($T$8:$AM$112),ROW($T$8:$AM$112)),\"\"),ROWS($V$152:AK160)),COLUMNS($V$152:AK160))","v":{"$error":"#NUM!"}},{"$f":"INDEX($T$8:$AM$112,SMALL(IF(COUNTIF($T$5,$T$8:$AM$112),MATCH(ROW($T$8:$AM$112),ROW($T$8:$AM$112)),\"\"),ROWS($V$152:AL160)),COLUMNS($V$152:AL160))","v":{"$error":"#NUM!"}},{"$f":"INDEX($T$8:$AM$112,SMALL(IF(COUNTIF($T$5,$T$8:$AM$112),MATCH(ROW($T$8:$AM$112),ROW($T$8:$AM$112)),\"\"),ROWS($V$152:AM160)),COLUMNS($V$152:AM160))","v":{"$error":"#NUM!"}},{"$f":"INDEX($T$8:$AM$112,SMALL(IF(COUNTIF($T$5,$T$8:$AM$112),MATCH(ROW($T$8:$AM$112),ROW($T$8:$AM$112)),\"\"),ROWS($V$152:AN160)),COLUMNS($V$152:AN160))","v":{"$error":"#NUM!"}},{"$f":"INDEX($T$8:$AM$112,SMALL(IF(COUNTIF($T$5,$T$8:$AM$112),MATCH(ROW($T$8:$AM$112),ROW($T$8:$AM$112)),\"\"),ROWS($V$152:AO160)),COLUMNS($V$152:AO160))","v":{"$error":"#NUM!"}}]
["",null,"",null,"$",null,null,null,null,null,null,null,null,null,null,"$",null,null,null,{"$f":"INDEX($T$8:$AM$112,SMALL(IF(COUNTIF($T$5,$T$8:$AM$112),MATCH(ROW($T$8:$AM$112),ROW($T$8:$AM$112)),\"\"),ROWS(V$152:$V161)),COLUMNS(V$152:$V161))","v":{"$error":"#NUM!"}},{"$f":"INDEX($T$8:$AM$112,SMALL(IF(COUNTIF($T$5,$T$8:$AM$112),MATCH(ROW($T$8:$AM$112),ROW($T$8:$AM$112)),\"\"),ROWS($V$152:W161)),COLUMNS($V$152:W161))","v":{"$error":"#NUM!"}},{"$f":"INDEX($T$8:$AM$112,SMALL(IF(COUNTIF($T$5,$T$8:$AM$112),MATCH(ROW($T$8:$AM$112),ROW($T$8:$AM$112)),\"\"),ROWS($V$152:X161)),COLUMNS($V$152:X161))","v":{"$error":"#NUM!"}},{"$f":"INDEX($T$8:$AM$112,SMALL(IF(COUNTIF($T$5,$T$8:$AM$112),MATCH(ROW($T$8:$AM$112),ROW($T$8:$AM$112)),\"\"),ROWS($V$152:Y161)),COLUMNS($V$152:Y161))","v":{"$error":"#NUM!"}},{"$f":"INDEX($T$8:$AM$112,SMALL(IF(COUNTIF($T$5,$T$8:$AM$112),MATCH(ROW($T$8:$AM$112),ROW($T$8:$AM$112)),\"\"),ROWS($V$152:Z161)),COLUMNS($V$152:Z161))","v":{"$error":"#NUM!"}},{"$f":"INDEX($T$8:$AM$112,SMALL(IF(COUNTIF($T$5,$T$8:$AM$112),MATCH(ROW($T$8:$AM$112),ROW($T$8:$AM$112)),\"\"),ROWS($V$152:AA161)),COLUMNS($V$152:AA161))","v":{"$error":"#NUM!"}},{"$f":"INDEX($T$8:$AM$112,SMALL(IF(COUNTIF($T$5,$T$8:$AM$112),MATCH(ROW($T$8:$AM$112),ROW($T$8:$AM$112)),\"\"),ROWS($V$152:AB161)),COLUMNS($V$152:AB161))","v":{"$error":"#NUM!"}},{"$f":"INDEX($T$8:$AM$112,SMALL(IF(COUNTIF($T$5,$T$8:$AM$112),MATCH(ROW($T$8:$AM$112),ROW($T$8:$AM$112)),\"\"),ROWS($V$152:AC161)),COLUMNS($V$152:AC161))","v":{"$error":"#NUM!"}},{"$f":"INDEX($T$8:$AM$112,SMALL(IF(COUNTIF($T$5,$T$8:$AM$112),MATCH(ROW($T$8:$AM$112),ROW($T$8:$AM$112)),\"\"),ROWS($V$152:AD161)),COLUMNS($V$152:AD161))","v":{"$error":"#NUM!"}},{"$f":"INDEX($T$8:$AM$112,SMALL(IF(COUNTIF($T$5,$T$8:$AM$112),MATCH(ROW($T$8:$AM$112),ROW($T$8:$AM$112)),\"\"),ROWS($V$152:AE161)),COLUMNS($V$152:AE161))","v":{"$error":"#NUM!"}},{"$f":"INDEX($T$8:$AM$112,SMALL(IF(COUNTIF($T$5,$T$8:$AM$112),MATCH(ROW($T$8:$AM$112),ROW($T$8:$AM$112)),\"\"),ROWS($V$152:AF161)),COLUMNS($V$152:AF161))","v":{"$error":"#NUM!"}},{"$f":"INDEX($T$8:$AM$112,SMALL(IF(COUNTIF($T$5,$T$8:$AM$112),MATCH(ROW($T$8:$AM$112),ROW($T$8:$AM$112)),\"\"),ROWS($V$152:AG161)),COLUMNS($V$152:AG161))","v":{"$error":"#NUM!"}},{"$f":"INDEX($T$8:$AM$112,SMALL(IF(COUNTIF($T$5,$T$8:$AM$112),MATCH(ROW($T$8:$AM$112),ROW($T$8:$AM$112)),\"\"),ROWS($V$152:AH161)),COLUMNS($V$152:AH161))","v":{"$error":"#NUM!"}},{"$f":"INDEX($T$8:$AM$112,SMALL(IF(COUNTIF($T$5,$T$8:$AM$112),MATCH(ROW($T$8:$AM$112),ROW($T$8:$AM$112)),\"\"),ROWS($V$152:AI161)),COLUMNS($V$152:AI161))","v":{"$error":"#NUM!"}},{"$f":"INDEX($T$8:$AM$112,SMALL(IF(COUNTIF($T$5,$T$8:$AM$112),MATCH(ROW($T$8:$AM$112),ROW($T$8:$AM$112)),\"\"),ROWS($V$152:AJ161)),COLUMNS($V$152:AJ161))","v":{"$error":"#NUM!"}},{"$f":"INDEX($T$8:$AM$112,SMALL(IF(COUNTIF($T$5,$T$8:$AM$112),MATCH(ROW($T$8:$AM$112),ROW($T$8:$AM$112)),\"\"),ROWS($V$152:AK161)),COLUMNS($V$152:AK161))","v":{"$error":"#NUM!"}},{"$f":"INDEX($T$8:$AM$112,SMALL(IF(COUNTIF($T$5,$T$8:$AM$112),MATCH(ROW($T$8:$AM$112),ROW($T$8:$AM$112)),\"\"),ROWS($V$152:AL161)),COLUMNS($V$152:AL161))","v":{"$error":"#NUM!"}},{"$f":"INDEX($T$8:$AM$112,SMALL(IF(COUNTIF($T$5,$T$8:$AM$112),MATCH(ROW($T$8:$AM$112),ROW($T$8:$AM$112)),\"\"),ROWS($V$152:AM161)),COLUMNS($V$152:AM161))","v":{"$error":"#NUM!"}},{"$f":"INDEX($T$8:$AM$112,SMALL(IF(COUNTIF($T$5,$T$8:$AM$112),MATCH(ROW($T$8:$AM$112),ROW($T$8:$AM$112)),\"\"),ROWS($V$152:AN161)),COLUMNS($V$152:AN161))","v":{"$error":"#NUM!"}},{"$f":"INDEX($T$8:$AM$112,SMALL(IF(COUNTIF($T$5,$T$8:$AM$112),MATCH(ROW($T$8:$AM$112),ROW($T$8:$AM$112)),\"\"),ROWS($V$152:AO161)),COLUMNS($V$152:AO161))","v":{"$error":"#NUM!"}}]
["",null,"",null,"$",null,null,null,null,null,null,null,null,null,null,"$",null,null,null,{"$f":"INDEX($T$8:$AM$112,SMALL(IF(COUNTIF($T$5,$T$8:$AM$112),MATCH(ROW($T$8:$AM$112),ROW($T$8:$AM$112)),\"\"),ROWS(V$152:$V162)),COLUMNS(V$152:$V162))","v":{"$error":"#NUM!"}},{"$f":"INDEX($T$8:$AM$112,SMALL(IF(COUNTIF($T$5,$T$8:$AM$112),MATCH(ROW($T$8:$AM$112),ROW($T$8:$AM$112)),\"\"),ROWS($V$152:W162)),COLUMNS($V$152:W162))","v":{"$error":"#NUM!"}},{"$f":"INDEX($T$8:$AM$112,SMALL(IF(COUNTIF($T$5,$T$8:$AM$112),MATCH(ROW($T$8:$AM$112),ROW($T$8:$AM$112)),\"\"),ROWS($V$152:X162)),COLUMNS($V$152:X162))","v":{"$error":"#NUM!"}},{"$f":"INDEX($T$8:$AM$112,SMALL(IF(COUNTIF($T$5,$T$8:$AM$112),MATCH(ROW($T$8:$AM$112),ROW($T$8:$AM$112)),\"\"),ROWS($V$152:Y162)),COLUMNS($V$152:Y162))","v":{"$error":"#NUM!"}},{"$f":"INDEX($T$8:$AM$112,SMALL(IF(COUNTIF($T$5,$T$8:$AM$112),MATCH(ROW($T$8:$AM$112),ROW($T$8:$AM$112)),\"\"),ROWS($V$152:Z162)),COLUMNS($V$152:Z162))","v":{"$error":"#NUM!"}},{"$f":"INDEX($T$8:$AM$112,SMALL(IF(COUNTIF($T$5,$T$8:$AM$112),MATCH(ROW($T$8:$AM$112),ROW($T$8:$AM$112)),\"\"),ROWS($V$152:AA162)),COLUMNS($V$152:AA162))","v":{"$error":"#NUM!"}},{"$f":"INDEX($T$8:$AM$112,SMALL(IF(COUNTIF($T$5,$T$8:$AM$112),MATCH(ROW($T$8:$AM$112),ROW($T$8:$AM$112)),\"\"),ROWS($V$152:AB162)),COLUMNS($V$152:AB162))","v":{"$error":"#NUM!"}},{"$f":"INDEX($T$8:$AM$112,SMALL(IF(COUNTIF($T$5,$T$8:$AM$112),MATCH(ROW($T$8:$AM$112),ROW($T$8:$AM$112)),\"\"),ROWS($V$152:AC162)),COLUMNS($V$152:AC162))","v":{"$error":"#NUM!"}},{"$f":"INDEX($T$8:$AM$112,SMALL(IF(COUNTIF($T$5,$T$8:$AM$112),MATCH(ROW($T$8:$AM$112),ROW($T$8:$AM$112)),\"\"),ROWS($V$152:AD162)),COLUMNS($V$152:AD162))","v":{"$error":"#NUM!"}},{"$f":"INDEX($T$8:$AM$112,SMALL(IF(COUNTIF($T$5,$T$8:$AM$112),MATCH(ROW($T$8:$AM$112),ROW($T$8:$AM$112)),\"\"),ROWS($V$152:AE162)),COLUMNS($V$152:AE162))","v":{"$error":"#NUM!"}},{"$f":"INDEX($T$8:$AM$112,SMALL(IF(COUNTIF($T$5,$T$8:$AM$112),MATCH(ROW($T$8:$AM$112),ROW($T$8:$AM$112)),\"\"),ROWS($V$152:AF162)),COLUMNS($V$152:AF162))","v":{"$error":"#NUM!"}},{"$f":"INDEX($T$8:$AM$112,SMALL(IF(COUNTIF($T$5,$T$8:$AM$112),MATCH(ROW($T$8:$AM$112),ROW($T$8:$AM$112)),\"\"),ROWS($V$152:AG162)),COLUMNS($V$152:AG162))","v":{"$error":"#NUM!"}},{"$f":"INDEX($T$8:$AM$112,SMALL(IF(COUNTIF($T$5,$T$8:$AM$112),MATCH(ROW($T$8:$AM$112),ROW($T$8:$AM$112)),\"\"),ROWS($V$152:AH162)),COLUMNS($V$152:AH162))","v":{"$error":"#NUM!"}},{"$f":"INDEX($T$8:$AM$112,SMALL(IF(COUNTIF($T$5,$T$8:$AM$112),MATCH(ROW($T$8:$AM$112),ROW($T$8:$AM$112)),\"\"),ROWS($V$152:AI162)),COLUMNS($V$152:AI162))","v":{"$error":"#NUM!"}},{"$f":"INDEX($T$8:$AM$112,SMALL(IF(COUNTIF($T$5,$T$8:$AM$112),MATCH(ROW($T$8:$AM$112),ROW($T$8:$AM$112)),\"\"),ROWS($V$152:AJ162)),COLUMNS($V$152:AJ162))","v":{"$error":"#NUM!"}},{"$f":"INDEX($T$8:$AM$112,SMALL(IF(COUNTIF($T$5,$T$8:$AM$112),MATCH(ROW($T$8:$AM$112),ROW($T$8:$AM$112)),\"\"),ROWS($V$152:AK162)),COLUMNS($V$152:AK162))","v":{"$error":"#NUM!"}},{"$f":"INDEX($T$8:$AM$112,SMALL(IF(COUNTIF($T$5,$T$8:$AM$112),MATCH(ROW($T$8:$AM$112),ROW($T$8:$AM$112)),\"\"),ROWS($V$152:AL162)),COLUMNS($V$152:AL162))","v":{"$error":"#NUM!"}},{"$f":"INDEX($T$8:$AM$112,SMALL(IF(COUNTIF($T$5,$T$8:$AM$112),MATCH(ROW($T$8:$AM$112),ROW($T$8:$AM$112)),\"\"),ROWS($V$152:AM162)),COLUMNS($V$152:AM162))","v":{"$error":"#NUM!"}},{"$f":"INDEX($T$8:$AM$112,SMALL(IF(COUNTIF($T$5,$T$8:$AM$112),MATCH(ROW($T$8:$AM$112),ROW($T$8:$AM$112)),\"\"),ROWS($V$152:AN162)),COLUMNS($V$152:AN162))","v":{"$error":"#NUM!"}},{"$f":"INDEX($T$8:$AM$112,SMALL(IF(COUNTIF($T$5,$T$8:$AM$112),MATCH(ROW($T$8:$AM$112),ROW($T$8:$AM$112)),\"\"),ROWS($V$152:AO162)),COLUMNS($V$152:AO162))","v":{"$error":"#NUM!"}}]
["",null,"",null,"$",null,null,null,null,null,null,null,null,null,null,"$",null,null,null,{"$f":"INDEX($T$8:$AM$112,SMALL(IF(COUNTIF($T$5,$T$8:$AM$112),MATCH(ROW($T$8:$AM$112),ROW($T$8:$AM$112)),\"\"),ROWS(V$152:$V163)),COLUMNS(V$152:$V163))","v":{"$error":"#NUM!"}},{"$f":"INDEX($T$8:$AM$112,SMALL(IF(COUNTIF($T$5,$T$8:$AM$112),MATCH(ROW($T$8:$AM$112),ROW($T$8:$AM$112)),\"\"),ROWS($V$152:W163)),COLUMNS($V$152:W163))","v":{"$error":"#NUM!"}},{"$f":"INDEX($T$8:$AM$112,SMALL(IF(COUNTIF($T$5,$T$8:$AM$112),MATCH(ROW($T$8:$AM$112),ROW($T$8:$AM$112)),\"\"),ROWS($V$152:X163)),COLUMNS($V$152:X163))","v":{"$error":"#NUM!"}},{"$f":"INDEX($T$8:$AM$112,SMALL(IF(COUNTIF($T$5,$T$8:$AM$112),MATCH(ROW($T$8:$AM$112),ROW($T$8:$AM$112)),\"\"),ROWS($V$152:Y163)),COLUMNS($V$152:Y163))","v":{"$error":"#NUM!"}},{"$f":"INDEX($T$8:$AM$112,SMALL(IF(COUNTIF($T$5,$T$8:$AM$112),MATCH(ROW($T$8:$AM$112),ROW($T$8:$AM$112)),\"\"),ROWS($V$152:Z163)),COLUMNS($V$152:Z163))","v":{"$error":"#NUM!"}},{"$f":"INDEX($T$8:$AM$112,SMALL(IF(COUNTIF($T$5,$T$8:$AM$112),MATCH(ROW($T$8:$AM$112),ROW($T$8:$AM$112)),\"\"),ROWS($V$152:AA163)),COLUMNS($V$152:AA163))","v":{"$error":"#NUM!"}},{"$f":"INDEX($T$8:$AM$112,SMALL(IF(COUNTIF($T$5,$T$8:$AM$112),MATCH(ROW($T$8:$AM$112),ROW($T$8:$AM$112)),\"\"),ROWS($V$152:AB163)),COLUMNS($V$152:AB163))","v":{"$error":"#NUM!"}},{"$f":"INDEX($T$8:$AM$112,SMALL(IF(COUNTIF($T$5,$T$8:$AM$112),MATCH(ROW($T$8:$AM$112),ROW($T$8:$AM$112)),\"\"),ROWS($V$152:AC163)),COLUMNS($V$152:AC163))","v":{"$error":"#NUM!"}},{"$f":"INDEX($T$8:$AM$112,SMALL(IF(COUNTIF($T$5,$T$8:$AM$112),MATCH(ROW($T$8:$AM$112),ROW($T$8:$AM$112)),\"\"),ROWS($V$152:AD163)),COLUMNS($V$152:AD163))","v":{"$error":"#NUM!"}},{"$f":"INDEX($T$8:$AM$112,SMALL(IF(COUNTIF($T$5,$T$8:$AM$112),MATCH(ROW($T$8:$AM$112),ROW($T$8:$AM$112)),\"\"),ROWS($V$152:AE163)),COLUMNS($V$152:AE163))","v":{"$error":"#NUM!"}},{"$f":"INDEX($T$8:$AM$112,SMALL(IF(COUNTIF($T$5,$T$8:$AM$112),MATCH(ROW($T$8:$AM$112),ROW($T$8:$AM$112)),\"\"),ROWS($V$152:AF163)),COLUMNS($V$152:AF163))","v":{"$error":"#NUM!"}},{"$f":"INDEX($T$8:$AM$112,SMALL(IF(COUNTIF($T$5,$T$8:$AM$112),MATCH(ROW($T$8:$AM$112),ROW($T$8:$AM$112)),\"\"),ROWS($V$152:AG163)),COLUMNS($V$152:AG163))","v":{"$error":"#NUM!"}},{"$f":"INDEX($T$8:$AM$112,SMALL(IF(COUNTIF($T$5,$T$8:$AM$112),MATCH(ROW($T$8:$AM$112),ROW($T$8:$AM$112)),\"\"),ROWS($V$152:AH163)),COLUMNS($V$152:AH163))","v":{"$error":"#NUM!"}},{"$f":"INDEX($T$8:$AM$112,SMALL(IF(COUNTIF($T$5,$T$8:$AM$112),MATCH(ROW($T$8:$AM$112),ROW($T$8:$AM$112)),\"\"),ROWS($V$152:AI163)),COLUMNS($V$152:AI163))","v":{"$error":"#NUM!"}},{"$f":"INDEX($T$8:$AM$112,SMALL(IF(COUNTIF($T$5,$T$8:$AM$112),MATCH(ROW($T$8:$AM$112),ROW($T$8:$AM$112)),\"\"),ROWS($V$152:AJ163)),COLUMNS($V$152:AJ163))","v":{"$error":"#NUM!"}},{"$f":"INDEX($T$8:$AM$112,SMALL(IF(COUNTIF($T$5,$T$8:$AM$112),MATCH(ROW($T$8:$AM$112),ROW($T$8:$AM$112)),\"\"),ROWS($V$152:AK163)),COLUMNS($V$152:AK163))","v":{"$error":"#NUM!"}},{"$f":"INDEX($T$8:$AM$112,SMALL(IF(COUNTIF($T$5,$T$8:$AM$112),MATCH(ROW($T$8:$AM$112),ROW($T$8:$AM$112)),\"\"),ROWS($V$152:AL163)),COLUMNS($V$152:AL163))","v":{"$error":"#NUM!"}},{"$f":"INDEX($T$8:$AM$112,SMALL(IF(COUNTIF($T$5,$T$8:$AM$112),MATCH(ROW($T$8:$AM$112),ROW($T$8:$AM$112)),\"\"),ROWS($V$152:AM163)),COLUMNS($V$152:AM163))","v":{"$error":"#NUM!"}},{"$f":"INDEX($T$8:$AM$112,SMALL(IF(COUNTIF($T$5,$T$8:$AM$112),MATCH(ROW($T$8:$AM$112),ROW($T$8:$AM$112)),\"\"),ROWS($V$152:AN163)),COLUMNS($V$152:AN163))","v":{"$error":"#NUM!"}},{"$f":"INDEX($T$8:$AM$112,SMALL(IF(COUNTIF($T$5,$T$8:$AM$112),MATCH(ROW($T$8:$AM$112),ROW($T$8:$AM$112)),\"\"),ROWS($V$152:AO163)),COLUMNS($V$152:AO163))","v":{"$error":"#NUM!"}}]
["Self- Perform Subtotal (Must not Exceed 20% of Total Amount)",null,null,null,null,null,null,null,null,null,null,"Percent of Total:",{"$f":"IFERROR(Q160/(Q160+Q114),\"\")","v":""},null,null,"Lump Sum",{"$f":"Q148","v":0},null,null,null,null,null,null,null,null,null,null,null,null,null,null,null,null,null,null,null,null,null,null,null,null,null,null,null,null,null,null,null,null,null,"Add sep total for Laborer"]
[null,null,null,null,null,null,null,null,null,null,null,null,null,null,null,null,null,null,null,null,null,null,null,null,null,null,null,null,null,null,null,null,null,null,null,null,null,null,null,null,null,null,null,null,null,null,null,null,null,null,"Same for GMP"]
[null,null,null,null,null,null,null,null,null,null,null,null,null,null,null,"Total Amount",{"$f":"Q160+Q114+Q144","v":0}]
[null,null,null,null,null,null,null,null,null,null,null,null,null,null,null,null,null,null,null,null,{"$f":"IF(OR($M$160=\"\",$M$160<0.2),FALSE,TRUE)","v":false}]
["Detail the Reason Self-Performed Total Exceeds 20%"]
[{"$f":"'FLCC CSI Cost Estimate Summary'!A165:T170","v":0}]
[]
[]
[]
[]
[]
["C.2. CM General Conditions"]
[]
["Description",null,null,null,null,null,null,null,null,null,null,null,null,null,null,null,"Amount"]
[null,null,null,null,null,null,null,null,null,null,null,null,null,null,null,null,null,null,null,null,null,null,null,null,null,null,null,null,null,null,null,null,null,null,null,null,null,null,null,null,null,null,null,null,null,null,null,null,null,"*"]
[{"$f":"'FLCC CSI Cost Estimate Summary'!A175:P175","v":"Temp Protection"},null,null,null,null,null,null,null,null,null,null,null,null,null,null,null,{"$f":"'FLCC CSI Cost Estimate Summary'!Q175:R175","v":0}]
[{"$f":"'FLCC CSI Cost Estimate Summary'!A176:P176","v":"Dumpsters"},null,null,null,null,null,null,null,null,null,null,null,null,null,null,null,{"$f":"'FLCC CSI Cost Estimate Summary'!Q176:R176","v":0}]
[{"$f":"'FLCC CSI Cost Estimate Summary'!A177:P177","v":"Safety"},null,null,null,null,null,null,null,null,null,null,null,null,null,null,null,{"$f":"'FLCC CSI Cost Estimate Summary'!Q177:R177","v":0}]
[{"$f":"'FLCC CSI Cost Estimate Summary'!A178:P178","v":"Signage"},null,null,null,null,null,null,null,null,null,null,null,null,null,null,null,{"$f":"'FLCC CSI Cost Estimate Summary'!Q178:R178","v":0}]
[{"$f":"'FLCC CSI Cost Estimate Summary'!A179:P179","v":"IT Consumables"},null,null,null,null,null,null,null,null,null,null,null,null,null,null,null,{"$f":"'FLCC CSI Cost Estimate Summary'!Q179:R179","v":0}]
[{"$f":"'FLCC CSI Cost Estimate Summary'!A180:P180","v":"Progress/Final cleaning"},null,null,null,null,null,null,null,null,null,null,null,null,null,null,null,{"$f":"'FLCC CSI Cost Estimate Summary'!Q180:R180","v":0}]
[{"$f":"'FLCC CSI Cost Estimate Summary'!A181:P181","v":0},null,null,null,null,null,null,null,null,null,null,null,null,null,null,null,{"$f":"'FLCC CSI Cost Estimate Summary'!Q181:R181","v":0}]
[{"$f":"'FLCC CSI Cost Estimate Summary'!A182:P182","v":0},null,null,null,null,null,null,null,null,null,null,null,null,null,null,null,{"$f":"'FLCC CSI Cost Estimate Summary'!Q182:R182","v":0}]
[{"$f":"'FLCC CSI Cost Estimate Summary'!A183:P183","v":0},null,null,null,null,null,null,null,null,null,null,null,null,null,null,null,{"$f":"'FLCC CSI Cost Estimate Summary'!Q183:R183","v":0}]
[{"$f":"'FLCC CSI Cost Estimate Summary'!A184:P184","v":0},null,null,null,null,null,null,null,null,null,null,null,null,null,null,null,{"$f":"'FLCC CSI Cost Estimate Summary'!Q184:R184","v":0}]
[{"$f":"'FLCC CSI Cost Estimate Summary'!A185:P185","v":0},null,null,null,null,null,null,null,null,null,null,null,null,null,null,null,{"$f":"'FLCC CSI Cost Estimate Summary'!Q185:R185","v":0}]
[{"$f":"'FLCC CSI Cost Estimate Summary'!A186:P186","v":0},null,null,null,null,null,null,null,null,null,null,null,null,null,null,null,{"$f":"'FLCC CSI Cost Estimate Summary'!Q186:R186","v":0}]
[]
["Subtotal of General Conditions",null,null,null,null,null,null,null,null,null,null,null,null,null,null,null,{"$f":"SUBTOTAL(9,Q175:R187)","v":0}]
[]
[]
[]
[]
[]
[]
[]
[]
[]
["Insurance Costs will be $ per One Thousand $ ($1,000)",null,null,null,null,null,null,null,null,null,null,null,null,null,null,{"$f":"'FLCC CSI Cost Estimate Summary'!P198","v":0},{"$f":"Q210*P198/1000","v":0},null,null,null,null,null,null,null,null,null,null,null,null,null,null,null,null,null,null,null,null,null,null,null,null,null,null,null,null,null,null,null,null,"*"]
["Subtotal",null,null,null,null,null,null,null,null,null,null,null,null,null,null,{"$f":"Q198+Q210","v":0}]
["Performance and Payment Bond Cost will be $ per One Thousand $ ($1,000)",null,null,null,null,null,null,null,"First ",500000,{"$f":"'FLCC CSI Cost Estimate Summary'!K200","v":0},"Balance",null,{"$f":"'FLCC CSI Cost Estimate Summary'!N200","v":0},null,null,{"$f":"IF(P199>J200,(((K200*J200)/1000))+(((P199-J200)*N200)/1000),(P199*K200)/1000)","v":0}]
["Subtotal",null,null,null,null,null,null,null,null,null,null,null,null,null,null,{"$f":"Q200+P199","v":0}]
["Total General Conditions Costs",null,null,null,null,null,null,null,null,null,null,null,null,null,null,null,{"$f":"Q188+Q198+Q200","v":0}]
[]
["C.1 Trades",null,null,null,null,null,null,null,null,null,null,null,null,null,null,null,{"$f":"Q162","v":0}]
["C.2 Subtotal General Conditions (excludes insurance and bonds)",null,null,null,null,null,null,null,null,null,null,null,null,null,null,null,{"$f":"Q188","v":0}]
["C.3.1 Pre-Construction",null,null,null,null,null,null,null,null,null,null,null,null,null,null,null,{"$f":"O226","v":0}]
["C.3.2 Construction",null,null,null,null,null,null,null,null,null,null,null,null,null,null,null,{"$f":"O250","v":0}]
["C.4.1 Pre-Construction Fee",null,null,null,null,null,null,null,null,null,null,null,null,null,null,null,{"$f":"Q274","v":0}]
["C.4.2 Construction Fee",null,null,null,null,null,null,null,null,null,null,null,null,null,null,null,{"$f":"Q283","v":0}]
["Subtotal ",null,null,null,null,null,null,null,null,null,null,null,null,null,null,null,{"$f":"SUM(Q204:R209)+Q271","v":0}]
[]
["C.3 Construction Manager Personnel Costs"]
[]
["Pre-Construction"]
[]
["Title/Name",null,null,null,null,null,null,"Hourly Rate",null,null,null,"Total Hours",null,null,"Extended Amount",null,null,null,null,null,null,null,null,null,null,null,null,null,null,null,null,null,null,null,null,null,null,null,null,null,null,null,null,null,null,null,null,null,null,"*"]
[]
[{"$f":"'FLCC CSI Cost Estimate Summary'!A218:G218","v":0},null,null,null,null,null,null,{"$f":"'FLCC CSI Cost Estimate Summary'!H218:K218","v":0},null,null,null,{"$f":"'FLCC CSI Cost Estimate Summary'!L218:N218","v":0},null,null,{"$f":"H218*L218","v":0}]
[{"$f":"'FLCC CSI Cost Estimate Summary'!A219:G219","v":0},null,null,null,null,null,null,{"$f":"'FLCC CSI Cost Estimate Summary'!H219:K219","v":0},null,null,null,{"$f":"'FLCC CSI Cost Estimate Summary'!L219:N219","v":0},null,null,0]
[{"$f":"'FLCC CSI Cost Estimate Summary'!A220:G220","v":0},null,null,null,null,null,null,{"$f":"'FLCC CSI Cost Estimate Summary'!H220:K220","v":0},null,null,null,{"$f":"'FLCC CSI Cost Estimate Summary'!L220:N220","v":0},null,null,0]
[{"$f":"'FLCC CSI Cost Estimate Summary'!A221:G221","v":0},null,null,null,null,null,null,{"$f":"'FLCC CSI Cost Estimate Summary'!H221:K221","v":0},null,null,null,{"$f":"'FLCC CSI Cost Estimate Summary'!L221:N221","v":0},null,null,0]
[{"$f":"'FLCC CSI Cost Estimate Summary'!A222:G222","v":0},null,null,null,null,null,null,{"$f":"'FLCC CSI Cost Estimate Summary'!H222:K222","v":0},null,null,null,{"$f":"'FLCC CSI Cost Estimate Summary'!L222:N222","v":0},null,null,0]
[{"$f":"'FLCC CSI Cost Estimate Summary'!A223:G223","v":0},null,null,null,null,null,null,{"$f":"'FLCC CSI Cost Estimate Summary'!H223:K223","v":0},null,null,null,{"$f":"'FLCC CSI Cost Estimate Summary'!L223:N223","v":0},null,null,0]
[{"$f":"'FLCC CSI Cost Estimate Summary'!A224:G224","v":0},null,null,null,null,null,null,{"$f":"'FLCC CSI Cost Estimate Summary'!H224:K224","v":0},null,null,null,{"$f":"'FLCC CSI Cost Estimate Summary'!L224:N224","v":0},null,null,{"$f":"H224*L224","v":0}]
[]
["Subtotal",null,null,null,null,null,null,null,null,null,null,null,null,null,{"$f":"SUBTOTAL(9,O218:P225)","v":0}]
[]
[]
[]
[]
[]
[]
[]
[]
[]
[]
[]
["Construction"]
[]
["Title/Name",null,null,null,null,null,null,"Hourly Rate",null,null,null,"Total Hours",null,null,"Extended Amount",null,null,null,null,null,null,null,null,null,null,null,null,null,null,null,null,null,null,null,null,null,null,null,null,null,null,null,null,null,null,null,null,null,null,"*"]
[]
[{"$f":"'FLCC CSI Cost Estimate Summary'!A242:G242","v":0},null,null,null,null,null,null,{"$f":"'FLCC CSI Cost Estimate Summary'!H242:K242","v":0},null,null,null,{"$f":"'FLCC CSI Cost Estimate Summary'!L242:N242","v":0},null,null,{"$f":"H242*L242","v":0}]
[{"$f":"'FLCC CSI Cost Estimate Summary'!A243:G243","v":0},null,null,null,null,null,null,{"$f":"'FLCC CSI Cost Estimate Summary'!H243:K243","v":0},null,null,null,{"$f":"'FLCC CSI Cost Estimate Summary'!L243:N243","v":0},null,null,0]
[{"$f":"'FLCC CSI Cost Estimate Summary'!A244:G244","v":0},null,null,null,null,null,null,{"$f":"'FLCC CSI Cost Estimate Summary'!H244:K244","v":0},null,null,null,{"$f":"'FLCC CSI Cost Estimate Summary'!L244:N244","v":0},null,null,0]
[{"$f":"'FLCC CSI Cost Estimate Summary'!A245:G245","v":0},null,null,null,null,null,null,{"$f":"'FLCC CSI Cost Estimate Summary'!H245:K245","v":0},null,null,null,{"$f":"'FLCC CSI Cost Estimate Summary'!L245:N245","v":0},null,null,0]
[{"$f":"'FLCC CSI Cost Estimate Summary'!A246:G246","v":0},null,null,null,null,null,null,{"$f":"'FLCC CSI Cost Estimate Summary'!H246:K246","v":0},null,null,null,{"$f":"'FLCC CSI Cost Estimate Summary'!L246:N246","v":0},null,null,0]
[{"$f":"'FLCC CSI Cost Estimate Summary'!A247:G247","v":0},null,null,null,null,null,null,{"$f":"'FLCC CSI Cost Estimate Summary'!H247:K247","v":0},null,null,null,{"$f":"'FLCC CSI Cost Estimate Summary'!L247:N247","v":0},null,null,0]
[{"$f":"'FLCC CSI Cost Estimate Summary'!A248:G248","v":0},null,null,null,null,null,null,{"$f":"'FLCC CSI Cost Estimate Summary'!H248:K248","v":0},null,null,null,{"$f":"'FLCC CSI Cost Estimate Summary'!L248:N248","v":0},null,null,0]
[]
["Subtotal",null,null,null,null,null,null,null,null,null,null,null,null,null,{"$f":"SUBTOTAL(9,O242:P249)","v":0}]
["Total Pre-Construction and Construction Personnel Costs",null,null,null,null,null,null,null,null,null,null,"Lump Sum",null,null,{"$f":"O250+O226","v":0}]
[]
[]
[]
[]
[]
[]
[]
[]
[]
[]
[]
[]
[]
["C.4.CM Fee"]
["Pre-Construction - Fee is based upon",null,null,null,null,null,null,null,null,0.04,"of Total Pre-Construction Personnel Costs and Pre-Construction Reimbursable Values"]
[]
["Pre-Construction Fee",null,null,null,null,null,null,null,null,null,null,null,null,null,null,null,"Amount",null,null,null,null,null,null,null,null,null,null,null,null,null,null,null,null,null,null,null,null,null,null,null,null,null,null,null,null,null,null,null,null,"*"]
["Pre-Construction Personnel Costs from Section B.3.1 Construction Manager Personnel Costs",null,null,null,null,null,null,null,null,null,null,null,null,null,null,null,{"$f":"O226","v":0}]
["Pre-Construction Reimbursable Values",null,null,null,null,null,null,null,null,null,null,null,null,null,null,null,{"$f":"'FLCC CSI Cost Estimate Summary'!Q270:R270","v":0}]
["Pre-Purchase Equipment",null,null,null,null,null,null,null,null,null,null,null,null,null,null,null,{"$f":"'FLCC CSI Cost Estimate Summary'!Q271:R271","v":0}]
["Subtotal",null,null,null,null,null,null,null,null,null,null,null,null,null,null,null,{"$f":"Q269+Q270+Q271","v":0},null,null,null,null,null,null,null,null,null,null,null,null,null,null,null,null,null,null,null,null,null,null,null,null,null,null,null,null,null,null,null,null,"Pre-Purchase Equipment (Contractor edits)"]
["Subtotal Above Multiplied by CM Pre-Construction Fee of ",null,null,null,null,null,null,null,null,null,{"$f":"J266","v":0.04},null,null,null,null,null,{"$f":"Q272*K273","v":0}]
["Total CM Pre-Construction Fee                                                                                                                         ",null,null,null,null,null,null,null,null,null,null,null,null,null,null,"Lump Sum",{"$f":"Q273","v":0}]
[]
[]
["Construction - Fee is based upon",null,null,null,null,null,null,null,null,0.04,"of Total Trade Contractor Costs"]
[]
["Construction Fee",null,null,null,null,null,null,null,null,null,null,null,null,null,null,null,"Amount",null,null,null,null,null,null,null,null,null,null,null,null,null,null,null,null,null,null,null,null,null,null,null,null,null,null,null,null,null,null,null,null,"*"]
["Trade Contract Costs from Section C.1 Trade Contractor Bid Summary",null,null,null,null,null,null,null,null,null,null,null,null,null,null,null,{"$f":"Q162","v":0}]
["Subtotal",null,null,null,null,null,null,null,null,null,null,null,null,null,null,null,{"$f":"Q280","v":0}]
["Subtotal Above Multiplied by CM Construction Fee of ",null,null,null,null,null,null,null,null,null,{"$f":"J277","v":0.04},null,null,null,null,null,{"$f":"Q281*K282","v":0}]
["Total CM Construction Fee                                                                                                                ",null,null,null,null,null,null,null,null,null,null,null,null,null,null,"Lump Sum",{"$f":"Q282","v":0}]
[]
["Total Pre-Construction and Construction Fee",null,null,null,null,null,null,null,null,null,null,null,null,null,"Total Lump Sum",null,{"$f":"Q283+Q274","v":0}]
[]
[]
["GMP - Trades and Construction Manager Cost Summary"]
[]
["C.1 Trade Contractor Bid",null,null,null,null,null,null,null,null,null,null,null,null,null,null,null,{"$f":"Q162","v":0}]
["C.2 CM General Conditions Total",null,null,null,null,null,null,null,null,null,null,null,null,null,null,null,{"$f":"Q202","v":0}]
["C.3 Pre-Construction Total",null,null,null,null,null,null,null,null,null,null,null,null,null,null,null,{"$f":"O226","v":0}]
["C.3 Construction Personnel Costs Total",null,null,null,null,null,null,null,null,null,null,null,null,null,null,null,{"$f":"O250","v":0}]
["C.4 CM Fee Total",null,null,null,null,null,null,null,null,null,null,null,null,null,null,null,{"$f":"Q285","v":0}]
["Pre-Construction Reimbursable Values and Pre-Purchase Equipment",null,null,null,null,null,null,null,null,null,null,null,null,null,null,null,{"$f":"Q270+Q271","v":0}]
["C.5 Construction Manager Total (Sum of C.2, C.3 and C.4)",null,null,null,null,null,null,null,null,null,null,null,null,null,null,null,{"$f":"Q291+Q292+Q294+Q295+Q293","v":0}]
["Combined Trade Contractor Bid Summary and Construction Manager Costs: "]
["Guaranteed Maximum Price (Sum of C.1, C.5 and Pre-Construction Reimbursable Values and Pre-Purchase Equipment )",null,null,null,null,null,null,null,null,null,null,null,null,null,"Grand Total Lump Sum",null,{"$f":"Q290+Q296","v":0}]
[]
[]
[]
[]
[]
[]
[]
[]
[]
[]
[]
[]
[]
[]
[]
[]
[]
[]
[]
[]
[]
[]
[]
[]
[]
[]
[]
[]
[]
[]
[]
[]
[]
[]
[]
[]
[]
[]
[]
[]
[]
[]
[]
[]
[]
[]
[]
[]
[]
[]
[]
[]
[]
[]
[]
[]
[]
[]
[]
[]
[]
[]
[]
[]
[]
[]
[]
[]
[]
[]
[]
[]
[]
[]
[]
[]
[]
[]
[]
[]
[]
[]
[]
[]
[]
[]
[]
[]
[]
[]
[]
[]
[]
[]
[]
[]
[]
[]
[]
[]
[]
[]
[]
[]
[]
[]
[]
[]
[]
[]
[]
[]
[]
[]
[]
[]
[]
[]
[]
[]
[]
[]
[]
[]
[]
[]
[]
[]
[]
[]
[]
[]
[]
[]
[]
[]
[]
[]
[]
[]
[]
[]
[]
[]
[]
[]
[]
[]
[]
[]
[]
[]
[]
[]
[]
[]
[]
[]
[]
[]
[]
[]
[]
[]
[]
[]
[]
[]
[]
[]
[]
[]
[]
[]
[]
[]
[]
[]
[]
[]
[]
[]
[]
[]
[]
[]
[]
[]
[]
[]
[]
[]
[]
[]
[]
[]
[]
[]
[]
[]
[]
[]
[]
[]
[null,null,null,null,null,null,null,null,null,null,null,null,null,null,null,null,0]
[null,null,null,null,null,null,null,0,null,null,null,0,null,null,{"$f":"H504*L504","v":0}]
[null,null,null,null,null,null,null,0,null,null,null,0,null,null,{"$f":"H505*L505","v":0}]

{"sheet":"Copy Me","index":7,"n_rows":505,"n_cols":51,"rows_kept":505,"cut":false,"hidden":true,"merged":[[293,0,293,15],[293,16,293,17],[289,0,289,15],[289,16,289,17],[290,0,290,15],[290,16,290,17],[291,0,291,15],[291,16,291,17],[504,0,504,6],[504,7,504,10],[504,11,504,13],[504,14,504,15],[297,0,297,13],[297,14,297,15],[297,16,297,17],[502,0,502,15],[502,16,502,17],[503,0,503,6],[503,7,503,10],[503,11,503,13],[503,14,503,15],[294,16,294,17],[295,16,295,17],[292,0,292,15],[281,0,281,7],[281,10,281,15],[281,16,281,17],[282,0,282,14],[282,16,282,17],[284,14,284,15],[284,16,284,17],[274,18,274,19],[278,0,278,15],[278,16,278,17],[279,0,279,15],[279,16,279,17],[280,0,280,15],[280,16,280,17],[272,0,272,7],[272,10,272,15],[272,16,272,17],[272,18,272,19],[273,0,273,14],[273,16,273,17],[273,18,273,19],[269,0,269,15],[269,16,269,17],[269,18,269,19],[270,16,270,17],[271,0,271,15],[271,16,271,17],[271,18,271,19],[265,18,265,19],[266,18,266,19],[267,0,267,15],[267,16,267,17],[267,18,267,19],[268,0,268,15],[268,16,268,17],[268,18,268,19],[248,18,248,19],[249,0,249,6],[249,7,249,10],[249,11,249,13],[249,14,249,15],[250,0,250,10],[250,11,250,13],[250,14,250,15],[246,0,246,6],[246,7,246,10],[246,11,246,13],[246,14,246,15],[247,0,247,6],[247,7,247,10],[247,11,247,13],[247,14,247,15],[244,0,244,6],[244,7,244,10],[244,11,244,13],[244,14,244,15],[245,0,245,6],[245,7,245,10],[245,11,245,13],[245,14,245,15],[242,0,242,6],[242,7,242,10],[242,11,242,13],[242,14,242,15],[243,0,243,6],[243,7,243,10],[243,11,243,13],[243,14,243,15],[239,0,240,6],[239,7,240,10],[239,11,240,13],[239,14,240,15],[241,0,241,6],[241,7,241,10],[241,11,241,13],[241,14,241,15],[223,0,223,6],[223,7,223,10],[223,11,223,13],[223,14,223,15],[225,0,225,6],[225,7,225,10],[225,11,225,13],[225,14,225,15],[221,0,221,6],[221,7,221,10],[221,11,221,13],[221,14,221,15],[222,0,222,6],[222,7,222,10],[222,11,222,13],[222,14,222,15],[219,0,219,6],[219,7,219,10],[219,11,219,13],[219,14,219,15],[220,0,220,6],[220,7,220,10],[220,11,220,13],[220,14,220,15],[217,0,217,6],[217,7,217,10],[217,11,217,13],[217,14,217,15],[218,0,218,6],[218,7,218,10],[218,11,218,13],[218,14,218,15],[208,0,208,15],[208,16,208,17],[209,0,209,15],[209,16,209,17],[215,0,216,6],[215,7,216,10],[215,11,216,13],[215,14,216,15],[205,0,205,15],[205,16,205,17],[206,0,206,15],[206,16,206,17],[207,0,207,15],[207,16,207,17],[202,0,202,15],[202,16,202,17],[203,0,203,15],[203,16,203,17],[204,0,204,15],[204,16,204,17],[199,16,199,17],[200,0,200,14],[200,16,200,17],[201,0,201,15],[201,16,201,17],[199,11,199,12],[199,13,199,14],[187,0,187,15],[187,16,187,17],[197,0,197,14],[197,16,197,17],[198,0,198,14],[198,16,198,17],[183,0,183,15],[183,16,183,17],[184,0,184,15],[184,16,184,17],[185,0,185,15],[185,16,185,17],[180,0,180,15],[180,16,180,17],[181,0,181,15],[181,16,181,17],[182,0,182,15],[182,16,182,17],[178,0,178,15],[178,16,178,17],[178,20,178,21],[178,22,178,23],[179,0,179,15],[179,16,179,17],[179,20,179,21],[179,22,179,23],[176,0,176,15],[176,16,176,17],[176,20,176,21],[176,22,176,23],[177,0,177,15],[177,16,177,17],[177,20,177,21],[177,22,177,23],[174,0,174,15],[174,16,174,17],[174,20,174,21],[174,22,174,23],[175,0,175,15],[175,16,175,17],[175,20,175,21],[175,22,175,23],[170,20,170,21],[170,22,170,23],[171,20,171,21],[171,22,171,23],[172,0,173,15],[172,16,173,17],[172,20,172,21],[172,22,172,23],[173,20,173,21],[173,22,173,23],[158,0,158,1],[158,2,158,3],[158,4,158,7],[159,16,159,17],[161,16,161,17],[164,0,169,19],[156,0,156,1],[156,2,156,3],[156,4,156,7],[157,0,157,1],[157,2,157,3],[157,4,157,7],[147,8,158,14],[147,16,158,17],[154,0,154,1],[154,2,154,3],[154,4,154,7],[155,0,155,1],[155,2,155,3],[155,4,155,7],[152,0,152,1],[152,2,152,3],[152,4,152,7],[153,0,153,1],[153,2,153,3],[153,4,153,7],[149,4,149,7],[150,0,150,1],[150,2,150,3],[150,4,150,7],[151,0,151,1],[151,2,151,3],[151,4,151,7],[147,0,147,1],[147,2,147,3],[147,4,147,7],[148,0,148,1],[148,2,148,3],[148,4,148,7],[149,0,149,1],[149,2,149,3],[140,2,140,3],[140,6,140,7],[141,0,141,15],[141,16,141,17],[143,16,143,17],[146,0,146,1],[146,2,146,3],[146,12,146,13],[137,0,140,1],[137,2,137,3],[137,6,137,7],[137,10,140,11],[137,12,140,13],[137,16,140,17],[138,2,138,3],[138,6,138,7],[139,2,139,3],[139,6,139,7],[146,4,146,7],[136,16,136,17],[113,11,113,14],[113,16,113,17],[132,0,135,1],[132,2,132,3],[132,6,132,7],[132,10,135,11],[132,12,135,13],[132,16,135,17],[133,2,133,3],[133,6,133,7],[131,16,131,17],[102,2,102,3],[102,6,102,7],[102,10,105,11],[102,12,105,13],[134,2,134,3],[134,6,134,7],[135,2,135,3],[135,6,135,7],[136,0,136,15],[109,2,109,3],[109,6,109,7],[110,2,110,3],[110,6,110,7],[111,0,111,15],[131,0,131,1],[131,2,131,3],[131,6,131,7],[131,8,131,9],[131,10,131,11],[131,12,131,13],[131,14,131,15],[111,16,111,17],[106,0,106,15],[106,16,106,17],[107,0,110,1],[107,2,107,3],[107,6,107,7],[107,10,110,11],[107,12,110,13],[107,16,110,17],[108,2,108,3],[108,6,108,7],[87,10,90,11],[87,12,90,13],[102,16,105,17],[97,0,100,1],[97,2,97,3],[97,6,97,7],[97,10,100,11],[97,12,100,13],[97,16,100,17],[98,2,98,3],[98,6,98,7],[99,2,99,3],[99,6,99,7],[103,2,103,3],[103,6,103,7],[104,2,104,3],[104,6,104,7],[105,2,105,3],[105,6,105,7],[100,2,100,3],[100,6,100,7],[101,0,101,15],[101,16,101,17],[102,0,105,1],[94,2,94,3],[94,6,94,7],[95,2,95,3],[95,6,95,7],[96,0,96,15],[96,16,96,17],[91,0,91,15],[91,16,91,17],[92,0,95,1],[92,2,92,3],[92,6,92,7],[92,10,95,11],[92,12,95,13],[92,16,95,17],[93,2,93,3],[93,6,93,7],[87,16,90,17],[82,0,85,1],[82,2,82,3],[82,6,82,7],[82,10,85,11],[82,12,85,13],[82,16,85,17],[83,2,83,3],[83,6,83,7],[84,2,84,3],[84,6,84,7],[88,2,88,3],[88,6,88,7],[89,2,89,3],[89,6,89,7],[90,2,90,3],[90,6,90,7],[85,2,85,3],[85,6,85,7],[86,0,86,15],[86,16,86,17],[87,0,90,1],[87,2,87,3],[87,6,87,7],[70,6,70,7],[71,0,71,15],[79,2,79,3],[79,6,79,7],[80,2,80,3],[80,6,80,7],[81,0,81,15],[81,16,81,17],[76,0,76,15],[76,16,76,17],[77,0,80,1],[77,2,77,3],[77,6,77,7],[77,10,80,11],[77,12,80,13],[77,16,80,17],[78,2,78,3],[78,6,78,7],[71,16,71,17],[72,0,75,1],[72,2,72,3],[72,6,72,7],[72,10,75,11],[72,12,75,13],[56,16,56,17],[57,0,60,1],[57,2,57,3],[57,6,57,7],[57,10,60,11],[57,12,60,13],[72,16,75,17],[67,0,70,1],[67,2,67,3],[67,6,67,7],[67,10,70,11],[67,12,70,13],[67,16,70,17],[68,2,68,3],[68,6,68,7],[69,2,69,3],[69,6,69,7],[73,2,73,3],[73,6,73,7],[74,2,74,3],[74,6,74,7],[75,2,75,3],[75,6,75,7],[70,2,70,3],[64,2,64,3],[64,6,64,7],[65,2,65,3],[65,6,65,7],[66,0,66,15],[66,16,66,17],[61,0,61,15],[61,16,61,17],[62,0,65,1],[62,2,62,3],[62,6,62,7],[62,10,65,11],[62,12,65,13],[62,16,65,17],[63,2,63,3],[63,6,63,7],[42,2,42,3],[42,6,42,7],[42,10,45,11],[42,12,45,13],[57,16,60,17],[52,0,55,1],[52,2,52,3],[52,6,52,7],[52,10,55,11],[52,12,55,13],[52,16,55,17],[53,2,53,3],[53,6,53,7],[54,2,54,3],[54,6,54,7],[58,2,58,3],[58,6,58,7],[59,2,59,3],[59,6,59,7],[60,2,60,3],[60,6,60,7],[55,2,55,3],[55,6,55,7],[56,0,56,15],[49,2,49,3],[49,6,49,7],[50,2,50,3],[50,6,50,7],[51,0,51,15],[51,16,51,17],[46,0,46,15],[46,16,46,17],[47,0,50,1],[47,2,47,3],[47,6,47,7],[47,10,50,11],[47,12,50,13],[47,16,50,17],[48,2,48,3],[48,6,48,7],[27,10,30,11],[27,12,30,13],[42,16,45,17],[37,0,40,1],[37,2,37,3],[37,6,37,7],[37,10,40,11],[37,12,40,13],[37,16,40,17],[38,2,38,3],[38,6,38,7],[39,2,39,3],[39,6,39,7],[43,2,43,3],[43,6,43,7],[44,2,44,3],[44,6,44,7],[45,2,45,3],[45,6,45,7],[40,2,40,3],[40,6,40,7],[41,0,41,15],[41,16,41,17],[42,0,45,1],[34,2,34,3],[34,6,34,7],[35,2,35,3],[35,6,35,7],[36,0,36,15],[36,16,36,17],[31,0,31,15],[31,16,31,17],[32,0,35,1],[32,2,32,3],[32,6,32,7],[32,10,35,11],[32,12,35,13],[32,16,35,17],[33,2,33,3],[33,6,33,7],[27,16,30,17],[22,0,25,1],[22,2,22,3],[22,6,22,7],[22,10,25,11],[22,12,25,13],[22,16,25,17],[23,2,23,3],[23,6,23,7],[24,2,24,3],[24,6,24,7],[28,2,28,3],[28,6,28,7],[29,2,29,3],[29,6,29,7],[30,2,30,3],[30,6,30,7],[25,2,25,3],[25,6,25,7],[26,0,26,15],[26,16,26,17],[27,0,30,1],[27,2,27,3],[27,6,27,7],[19,2,19,3],[19,6,19,7],[20,2,20,3],[20,6,20,7],[21,0,21,15],[21,16,21,17],[16,0,16,15],[16,16,16,17],[17,0,20,1],[17,2,17,3],[17,6,17,7],[17,10,20,11],[17,12,20,13],[17,16,20,17],[18,2,18,3],[18,6,18,7],[10,6,10,7],[11,0,11,15],[11,16,11,17],[12,0,15,1],[12,2,12,3],[12,6,12,7],[12,10,15,11],[12,12,15,13],[7,0,10,1],[7,2,7,3],[7,6,7,7],[7,10,10,11],[7,12,10,13],[7,16,10,17],[8,2,8,3],[292,16,292,17],[8,6,8,7],[9,2,9,3],[0,0,1,17],[4,0,6,1],[4,2,6,3],[4,4,6,4],[4,5,6,5],[4,6,6,7],[4,8,6,9],[4,10,6,11],[4,12,6,13],[4,14,6,15],[4,16,6,17],[2,16,2,17],[12,16,15,17],[13,2,13,3],[13,6,13,7],[14,2,14,3],[14,6,14,7],[15,2,15,3],[15,6,15,7],[9,6,9,7],[10,2,10,3]]}
["Trade Contractor Bid Summary - All proposals received from the Trade Contractors must follow this document in the same sequential order as noted on the following including any and all bid declinations.",null,null,null,null,null,null,null,null,null,null,null,null,null,null,null,null,null,"False",null,null,null,null,null,null,null,null,null,null,null,null,null,null,null,null,null,null,null,null,null,null,null,null,null,null,null,"Decline Bid"]
[null,null,null,null,null,null,null,null,null,null,null,null,null,null,null,null,null,null,null,null,null,null,null,null,null,null,null,null,null,null,null,null,null,null,null,null,null,null,null,null,null,null,null,null,null,null,"No Response"]
[null,null,null,null,null,null,null,null,null,null,null,null," = to be completed by Construction Manager",null,null,null,{"$f":"'FLCC Instructions'!P1","v":"Rev. 6/14/24"}]
[null,null,null,null,null,null,null,null,null,null,null,null," = predetermined or automatic calculation"]
["Scope/Trade\n(Includes CSI #'s for clarity)",null,"Proposed Trade Contractor/Self Perform",null,"Self Perform","Decline Bid or No Response","Proposed Amounts \n(low to high)",null,"No Estimates at GMP",null,"Selected Firm",null,"EMR",null,"Intended Awardee Proposal Detail  & (accepted alternates only)",null,"Total",null,null,true]
[]
[null,null,null,null,false,null,null,null,null,null,null,null,null,null,null,null,null,null,null,null,null,null,null,null,null,null,null,null,null,null,null,null,null,null,null,null,null,null,null,null,null,null,null,null,null,null,null,null,null,"*"]
[{"$f":"'FLCC CSI Cost Estimate Summary'!A8:B11","v":0},null,{"$f":"'FLCC CSI Cost Estimate Summary'!C8:D8","v":"Name"},null,{"$f":"'FLCC CSI Cost Estimate Summary'!E8","v":false},{"$f":"'FLCC CSI Cost Estimate Summary'!F8","v":0},{"$f":"'FLCC CSI Cost Estimate Summary'!G8:H8","v":0},null,{"$f":"'FLCC CSI Cost Estimate Summary'!$J8","v":false},false,{"$f":"C8","v":"Name"},null,{"$f":"'FLCC CSI Cost Estimate Summary'!M8:N11","v":0},null,"Base Bid",{"$f":"'FLCC CSI Cost Estimate Summary'!P8","v":0},{"$f":"IF(S8=$S$1,SUM(P8:P11),0)","v":0},null,{"$f":"IF(E8,\"True\",\"False\")","v":"False"},{"$f":"IF($S8=\"true\",A8,\"\")","v":""},{"$f":"IF($S8=\"true\",C8,\"\")","v":""},{"$f":"IF($S8=\"true\",E8,\"\")","v":""},{"$f":"IF($S8=\"true\",\"A\",\"\")","v":""},{"$f":"IF($S8=\"true\",\"A\",\"\")","v":""},{"$f":"IF($S8=\"true\",G8,\"\")","v":""},{"$f":"IF($S8=\"true\",\"A\",\"\")","v":""},{"$f":"IF($S8=\"true\",\"A\",\"\")","v":""},{"$f":"IF($S8=\"true\",\"A\",\"\")","v":""},{"$f":"IF($S8=\"true\",K8,\"\")","v":""},{"$f":"IF($S8=\"true\",M8,\"\")","v":""},{"$f":"IF($S8=\"true\",P8,\"\")","v":""},{"$f":"IF($S8=\"true\",P9,\"\")","v":""},{"$f":"IF($S8=\"true\",P10,\"\")","v":""},{"$f":"IF($S8=\"true\",P11,\"\")","v":""},{"$f":"IF($S8=\"true\",#REF!,\"\")","v":""},{"$f":"IF($S8=\"true\",SUM(P8:P11),\"\")","v":""}]
[null,null,{"$f":"'FLCC CSI Cost Estimate Summary'!C9:D9","v":"Name"},null,{"$f":"'FLCC CSI Cost Estimate Summary'!E9","v":false},{"$f":"'FLCC CSI Cost Estimate Summary'!F9","v":0},{"$f":"'FLCC CSI Cost Estimate Summary'!G9:H9","v":0},null,{"$f":"'FLCC CSI Cost Estimate Summary'!$J9","v":0},{"$f":"'FLCC CSI Cost Estimate Summary'!$J9","v":0},null,null,null,null,"Alternate",{"$f":"'FLCC CSI Cost Estimate Summary'!P9","v":0},null,null,{"$f":"IF(E9,\"True\",\"False\")","v":"False"},{"$f":"IF($S9=\"true\",A9,\"\")","v":""},{"$f":"IF($S9=\"true\",C9,\"\")","v":""},{"$f":"IF($S9=\"true\",E9,\"\")","v":""},{"$f":"IF($S9=\"true\",\"A\",\"\")","v":""},"",{"$f":"IF($S9=\"true\",G9,\"\")","v":""},{"$f":"IF($S9=\"true\",\"A\",\"\")","v":""},"","",{"$f":"IF($S9=\"true\",K9,\"\")","v":""},"","","","","",{"$f":"IF($S9=\"true\",#REF!,\"\")","v":""},{"$f":"IF($S9=\"true\",SUM(P9:P12),\"\")","v":""}]
[null,null,{"$f":"'FLCC CSI Cost Estimate Summary'!C10:D10","v":"Name"},null,{"$f":"'FLCC CSI Cost Estimate Summary'!E10","v":false},{"$f":"'FLCC CSI Cost Estimate Summary'!F10","v":0},{"$f":"'FLCC CSI Cost Estimate Summary'!G10:H10","v":0},null,{"$f":"'FLCC CSI Cost Estimate Summary'!$J10","v":0},{"$f":"'FLCC CSI Cost Estimate Summary'!$J10","v":0},null,null,null,null,"Alternate",{"$f":"'FLCC CSI Cost Estimate Summary'!P10","v":0},null,null,"False","","","","","","","","","","","","","","","",{"$f":"IF($S10=\"true\",#REF!,\"\")","v":""},""]
[null,null,{"$f":"'FLCC CSI Cost Estimate Summary'!C11:D11","v":"Name"},null,{"$f":"'FLCC CSI Cost Estimate Summary'!E11","v":false},{"$f":"'FLCC CSI Cost Estimate Summary'!F11","v":0},{"$f":"'FLCC CSI Cost Estimate Summary'!G11:H11","v":0},null,{"$f":"'FLCC CSI Cost Estimate Summary'!$J11","v":0},{"$f":"'FLCC CSI Cost Estimate Summary'!$J11","v":0},null,null,null,null,"Alternate",{"$f":"'FLCC CSI Cost Estimate Summary'!P11","v":0},null,null,"False","","","","","","","","","","","","","","","",{"$f":"IF($S11=\"true\",#REF!,\"\")","v":""},""]
[{"$f":"'FLCC CSI Cost Estimate Summary'!A12:P12","v":"Contractor Scope/Trade Detail:"},null,null,null,null,null,null,null,null,null,null,null,null,null,null,null,"AEC PM Approval:",null,"False","","","","","","","","","","","","","","","",{"$f":"IF($S12=\"true\",#REF!,\"\")","v":""},""]
[{"$f":"'FLCC CSI Cost Estimate Summary'!A13:B16","v":0},null,{"$f":"'FLCC CSI Cost Estimate Summary'!C13:D13","v":"Name"},null,{"$f":"'FLCC CSI Cost Estimate Summary'!E13","v":false},{"$f":"'FLCC CSI Cost Estimate Summary'!F13","v":0},{"$f":"'FLCC CSI Cost Estimate Summary'!G13:H13","v":0},null,false,{"$f":"'FLCC CSI Cost Estimate Summary'!$J13","v":false},{"$f":"C13","v":"Name"},null,{"$f":"'FLCC CSI Cost Estimate Summary'!M13:N16","v":0},null,"Base Bid",{"$f":"'FLCC CSI Cost Estimate Summary'!P13","v":0},{"$f":"IF(S13=$S$1,SUM(P13:P16),0)","v":0},null,"False","","","","","","","","","","","","","","","",{"$f":"IF($S13=\"true\",#REF!,\"\")","v":""},""]
[null,null,{"$f":"'FLCC CSI Cost Estimate Summary'!C14:D14","v":"Name"},null,{"$f":"'FLCC CSI Cost Estimate Summary'!E14","v":false},{"$f":"'FLCC CSI Cost Estimate Summary'!F14","v":0},{"$f":"'FLCC CSI Cost Estimate Summary'!G14:H14","v":0},null,{"$f":"'FLCC CSI Cost Estimate Summary'!J14","v":0},{"$f":"'FLCC CSI Cost Estimate Summary'!$J14","v":0},null,null,null,null,"Alternate",{"$f":"'FLCC CSI Cost Estimate Summary'!P14","v":0},null,null,"False","","","","","","","","","","","","","","","",{"$f":"IF($S14=\"true\",#REF!,\"\")","v":""},""]
[null,null,{"$f":"'FLCC CSI Cost Estimate Summary'!C15:D15","v":"Name"},null,{"$f":"'FLCC CSI Cost Estimate Summary'!E15","v":false},{"$f":"'FLCC CSI Cost Estimate Summary'!F15","v":0},{"$f":"'FLCC CSI Cost Estimate Summary'!G15:H15","v":0},null,{"$f":"'FLCC CSI Cost Estimate Summary'!J15","v":0},{"$f":"'FLCC CSI Cost Estimate Summary'!$J15","v":0},null,null,null,null,"Alternate",{"$f":"'FLCC CSI Cost Estimate Summary'!P15","v":0},null,null,"False","","","","","","","","","","","","","","","",{"$f":"IF($S15=\"true\",#REF!,\"\")","v":""},""]
[null,null,{"$f":"'FLCC CSI Cost Estimate Summary'!C16:D16","v":"Name"},null,{"$f":"'FLCC CSI Cost Estimate Summary'!E16","v":false},{"$f":"'FLCC CSI Cost Estimate Summary'!F16","v":0},{"$f":"'FLCC CSI Cost Estimate Summary'!G16:H16","v":0},null,{"$f":"'FLCC CSI Cost Estimate Summary'!J16","v":0},{"$f":"'FLCC CSI Cost Estimate Summary'!$J16","v":0},null,null,null,null,"Alternate",{"$f":"'FLCC CSI Cost Estimate Summary'!P16","v":0},null,null,"False","","","","","","","","","","","","","","","",{"$f":"IF($S16=\"true\",#REF!,\"\")","v":""},""]
[{"$f":"'FLCC CSI Cost Estimate Summary'!A17:P17","v":"Contractor Scope/Trade Detail:"},null,null,null,null,null,null,null,null,null,null,null,null,null,null,null,"AEC PM Approval:",null,"False","","","","","","","","","","","","","","","",{"$f":"IF($S17=\"true\",#REF!,\"\")","v":""},""]
[{"$f":"'FLCC CSI Cost Estimate Summary'!A18:B21","v":0},null,{"$f":"'FLCC CSI Cost Estimate Summary'!C18:D18","v":"Name"},null,{"$f":"'FLCC CSI Cost Estimate Summary'!E18","v":false},{"$f":"'FLCC CSI Cost Estimate Summary'!F18","v":0},{"$f":"'FLCC CSI Cost Estimate Summary'!G18:H18","v":0},null,{"$f":"'FLCC CSI Cost Estimate Summary'!J18","v":false},{"$f":"'FLCC CSI Cost Estimate Summary'!$J18","v":false},{"$f":"C18","v":"Name"},null,{"$f":"'FLCC CSI Cost Estimate Summary'!M18:N21","v":0},null,"Base Bid",{"$f":"'FLCC CSI Cost Estimate Summary'!P18","v":0},{"$f":"IF(S18=$S$1,SUM(P18:P21),0)","v":0},null,"False","","","","","","","","","","","","","","","",{"$f":"IF($S18=\"true\",#REF!,\"\")","v":""},""]
[null,null,{"$f":"'FLCC CSI Cost Estimate Summary'!C19:D19","v":"Name"},null,{"$f":"'FLCC CSI Cost Estimate Summary'!E19","v":false},{"$f":"'FLCC CSI Cost Estimate Summary'!F19","v":0},{"$f":"'FLCC CSI Cost Estimate Summary'!G19:H19","v":0},null,{"$f":"'FLCC CSI Cost Estimate Summary'!J19","v":false},{"$f":"'FLCC CSI Cost Estimate Summary'!$J19","v":false},null,null,null,null,"Alternate",{"$f":"'FLCC CSI Cost Estimate Summary'!P19","v":0},null,null,"False","","","","","","","","","","","","","","","",{"$f":"IF($S19=\"true\",#REF!,\"\")","v":""},""]
[null,null,{"$f":"'FLCC CSI Cost Estimate Summary'!C20:D20","v":"Name"},null,{"$f":"'FLCC CSI Cost Estimate Summary'!E20","v":false},{"$f":"'FLCC CSI Cost Estimate Summary'!F20","v":0},{"$f":"'FLCC CSI Cost Estimate Summary'!G20:H20","v":0},null,{"$f":"'FLCC CSI Cost Estimate Summary'!J20","v":false},{"$f":"'FLCC CSI Cost Estimate Summary'!$J20","v":false},null,null,null,null,"Alternate",{"$f":"'FLCC CSI Cost Estimate Summary'!P20","v":0},null,null,"False","","","","","","","","","","","","","","","",{"$f":"IF($S20=\"true\",#REF!,\"\")","v":""},""]
[null,null,{"$f":"'FLCC CSI Cost Estimate Summary'!C21:D21","v":"Name"},null,{"$f":"'FLCC CSI Cost Estimate Summary'!E21","v":false},{"$f":"'FLCC CSI Cost Estimate Summary'!F21","v":0},{"$f":"'FLCC CSI Cost Estimate Summary'!G21:H21","v":0},null,{"$f":"'FLCC CSI Cost Estimate Summary'!J21","v":false},{"$f":"'FLCC CSI Cost Estimate Summary'!$J21","v":false},null,null,null,null,"Alternate",{"$f":"'FLCC CSI Cost Estimate Summary'!P21","v":0},null,null,"False","","","","","","","","","","","","","","","",{"$f":"IF($S21=\"true\",#REF!,\"\")","v":""},""]
[{"$f":"'FLCC CSI Cost Estimate Summary'!A22:P22","v":"Contractor Scope/Trade Detail:"},null,null,null,null,null,null,null,null,null,null,null,null,null,null,null,"AEC PM Approval:",null,"False","","","","","","","","","","","","","","","",{"$f":"IF($S22=\"true\",#REF!,\"\")","v":""},""]
[{"$f":"'FLCC CSI Cost Estimate Summary'!A23:B26","v":0},null,{"$f":"'FLCC CSI Cost Estimate Summary'!C23:D23","v":"Name"},null,{"$f":"'FLCC CSI Cost Estimate Summary'!E23","v":false},{"$f":"'FLCC CSI Cost Estimate Summary'!F23","v":0},{"$f":"'FLCC CSI Cost Estimate Summary'!G23:H23","v":0},null,{"$f":"'FLCC CSI Cost Estimate Summary'!J23","v":false},{"$f":"'FLCC CSI Cost Estimate Summary'!$J23","v":false},{"$f":"C23","v":"Name"},null,{"$f":"'FLCC CSI Cost Estimate Summary'!M23:N26","v":0},null,"Base Bid",{"$f":"'FLCC CSI Cost Estimate Summary'!P23","v":0},{"$f":"IF(S23=$S$1,SUM(P23:P26),0)","v":0},null,"False","","","","","","","","","","","","","","","",{"$f":"IF($S23=\"true\",#REF!,\"\")","v":""},""]
[null,null,{"$f":"'FLCC CSI Cost Estimate Summary'!C24:D24","v":"Name"},null,{"$f":"'FLCC CSI Cost Estimate Summary'!E24","v":false},{"$f":"'FLCC CSI Cost Estimate Summary'!F24","v":0},{"$f":"'FLCC CSI Cost Estimate Summary'!G24:H24","v":0},null,{"$f":"'FLCC CSI Cost Estimate Summary'!J24","v":0},{"$f":"'FLCC CSI Cost Estimate Summary'!$J24","v":0},null,null,null,null,"Alternate",{"$f":"'FLCC CSI Cost Estimate Summary'!P24","v":0},null,null,"False","","","","","","","","","","","","","","","",{"$f":"IF($S24=\"true\",#REF!,\"\")","v":""},""]
[null,null,{"$f":"'FLCC CSI Cost Estimate Summary'!C25:D25","v":"Name"},null,{"$f":"'FLCC CSI Cost Estimate Summary'!E25","v":false},{"$f":"'FLCC CSI Cost Estimate Summary'!F25","v":0},{"$f":"'FLCC CSI Cost Estimate Summary'!G25:H25","v":0},null,{"$f":"'FLCC CSI Cost Estimate Summary'!J25","v":0},{"$f":"'FLCC CSI Cost Estimate Summary'!$J25","v":0},null,null,null,null,"Alternate",{"$f":"'FLCC CSI Cost Estimate Summary'!P25","v":0},null,null,"False","","","","","","","","","","","","","","","",{"$f":"IF($S25=\"true\",#REF!,\"\")","v":""},""]
[null,null,{"$f":"'FLCC CSI Cost Estimate Summary'!C26:D26","v":"Name"},null,{"$f":"'FLCC CSI Cost Estimate Summary'!E26","v":false},{"$f":"'FLCC CSI Cost Estimate Summary'!F26","v":0},{"$f":"'FLCC CSI Cost Estimate Summary'!G26:H26","v":0},null,{"$f":"'FLCC CSI Cost Estimate Summary'!J26","v":0},{"$f":"'FLCC CSI Cost Estimate Summary'!$J26","v":0},null,null,null,null,"Alternate",{"$f":"'FLCC CSI Cost Estimate Summary'!P26","v":0},null,null,"False","","","","","","","","","","","","","","","",{"$f":"IF($S26=\"true\",#REF!,\"\")","v":""},""]
[{"$f":"'FLCC CSI Cost Estimate Summary'!A27:P27","v":"Contractor Scope/Trade Detail:"},null,null,null,null,null,null,null,null,null,null,null,null,null,null,null,"AEC PM Approval:",null,"False","","","","","","","","","","","","","","","",{"$f":"IF($S27=\"true\",#REF!,\"\")","v":""},""]
[{"$f":"'FLCC CSI Cost Estimate Summary'!A28:B31","v":0},null,{"$f":"'FLCC CSI Cost Estimate Summary'!C28:D28","v":"Name"},null,{"$f":"'FLCC CSI Cost Estimate Summary'!E28","v":0},{"$f":"'FLCC CSI Cost Estimate Summary'!F28","v":0},{"$f":"'FLCC CSI Cost Estimate Summary'!G28:H28","v":0},null,{"$f":"'FLCC CSI Cost Estimate Summary'!J28","v":0},{"$f":"'FLCC CSI Cost Estimate Summary'!$J28","v":0},{"$f":"C28","v":"Name"},null,{"$f":"'FLCC CSI Cost Estimate Summary'!M28:N31","v":0},null,"Base Bid",{"$f":"'FLCC CSI Cost Estimate Summary'!P28","v":0},{"$f":"IF(S28=$S$1,SUM(P28:P31),0)","v":0},null,"False","","","","","","","","","","","","","","","",{"$f":"IF($S28=\"true\",#REF!,\"\")","v":""},""]
[null,null,{"$f":"'FLCC CSI Cost Estimate Summary'!C29:D29","v":"Name"},null,{"$f":"'FLCC CSI Cost Estimate Summary'!E29","v":false},{"$f":"'FLCC CSI Cost Estimate Summary'!F29","v":0},{"$f":"'FLCC CSI Cost Estimate Summary'!G29:H29","v":0},null,{"$f":"'FLCC CSI Cost Estimate Summary'!J29","v":0},{"$f":"'FLCC CSI Cost Estimate Summary'!$J29","v":0},null,null,null,null,"Alternate",{"$f":"'FLCC CSI Cost Estimate Summary'!P29","v":0},null,null,"False","","","","","","","","","","","","","","","",{"$f":"IF($S29=\"true\",#REF!,\"\")","v":""},""]
[null,null,{"$f":"'FLCC CSI Cost Estimate Summary'!C30:D30","v":"Name"},null,{"$f":"'FLCC CSI Cost Estimate Summary'!E30","v":false},{"$f":"'FLCC CSI Cost Estimate Summary'!F30","v":0},{"$f":"'FLCC CSI Cost Estimate Summary'!G30:H30","v":0},null,{"$f":"'FLCC CSI Cost Estimate Summary'!J30","v":0},{"$f":"'FLCC CSI Cost Estimate Summary'!$J30","v":0},null,null,null,null,"Alternate",{"$f":"'FLCC CSI Cost Estimate Summary'!P30","v":0},null,null,"False","","","","","","","","","","","","","","","",{"$f":"IF($S30=\"true\",#REF!,\"\")","v":""},""]
[null,null,{"$f":"'FLCC CSI Cost Estimate Summary'!C31:D31","v":"Name"},null,{"$f":"'FLCC CSI Cost Estimate Summary'!E31","v":false},{"$f":"'FLCC CSI Cost Estimate Summary'!F31","v":0},{"$f":"'FLCC CSI Cost Estimate Summary'!G31:H31","v":0},null,{"$f":"'FLCC CSI Cost Estimate Summary'!J31","v":0},{"$f":"'FLCC CSI Cost Estimate Summary'!$J31","v":0},null,null,null,null,"Alternate",{"$f":"'FLCC CSI Cost Estimate Summary'!P31","v":0},null,null,"False","","","","","","","","","","","","","","","",{"$f":"IF($S31=\"true\",#REF!,\"\")","v":""},""]
[{"$f":"'FLCC CSI Cost Estimate Summary'!A32:P32","v":"Contractor Scope/Trade Detail:"},null,null,null,null,null,null,null,null,null,null,null,null,null,null,null,"AEC PM Approval:",null,"False","","","","","","","","","","","","","","","",{"$f":"IF($S32=\"true\",#REF!,\"\")","v":""},""]
[{"$f":"'FLCC CSI Cost Estimate Summary'!A33:B36","v":0},null,{"$f":"'FLCC CSI Cost Estimate Summary'!C33:D33","v":"Name"},null,{"$f":"'FLCC CSI Cost Estimate Summary'!E33","v":false},{"$f":"'FLCC CSI Cost Estimate Summary'!F33","v":0},{"$f":"'FLCC CSI Cost Estimate Summary'!G33:H33","v":0},null,{"$f":"'FLCC CSI Cost Estimate Summary'!J33","v":0},false,{"$f":"C33","v":"Name"},null,{"$f":"'FLCC CSI Cost Estimate Summary'!M33:N36","v":0},null,"Base Bid",{"$f":"'FLCC CSI Cost Estimate Summary'!P33","v":0},{"$f":"IF(S33=$S$1,SUM(P33:P36),0)","v":0},null,"False","","","","","","","","","","","","","","","",{"$f":"IF($S33=\"true\",#REF!,\"\")","v":""},""]
[null,null,{"$f":"'FLCC CSI Cost Estimate Summary'!C34:D34","v":"Name"},null,{"$f":"'FLCC CSI Cost Estimate Summary'!E34","v":false},{"$f":"'FLCC CSI Cost Estimate Summary'!F34","v":0},{"$f":"'FLCC CSI Cost Estimate Summary'!G34:H34","v":0},null,{"$f":"'FLCC CSI Cost Estimate Summary'!J34","v":0},{"$f":"'FLCC CSI Cost Estimate Summary'!$J34","v":0},null,null,null,null,"Alternate",{"$f":"'FLCC CSI Cost Estimate Summary'!P34","v":0},null,null,"False","","","","","","","","","","","","","","","",{"$f":"IF($S34=\"true\",#REF!,\"\")","v":""},""]
[null,null,{"$f":"'FLCC CSI Cost Estimate Summary'!C35:D35","v":"Name"},null,{"$f":"'FLCC CSI Cost Estimate Summary'!E35","v":false},{"$f":"'FLCC CSI Cost Estimate Summary'!F35","v":0},{"$f":"'FLCC CSI Cost Estimate Summary'!G35:H35","v":0},null,{"$f":"'FLCC CSI Cost Estimate Summary'!J35","v":0},{"$f":"'FLCC CSI Cost Estimate Summary'!$J35","v":0},null,null,null,null,"Alternate",{"$f":"'FLCC CSI Cost Estimate Summary'!P35","v":0},null,null,"False","","","","","","","","","","","","","","","",{"$f":"IF($S35=\"true\",#REF!,\"\")","v":""},""]
[null,null,{"$f":"'FLCC CSI Cost Estimate Summary'!C36:D36","v":"Name"},null,{"$f":"'FLCC CSI Cost Estimate Summary'!E36","v":false},{"$f":"'FLCC CSI Cost Estimate Summary'!F36","v":0},{"$f":"'FLCC CSI Cost Estimate Summary'!G36:H36","v":0},null,{"$f":"'FLCC CSI Cost Estimate Summary'!J36","v":0},{"$f":"'FLCC CSI Cost Estimate Summary'!$J36","v":0},null,null,null,null,"Alternate",{"$f":"'FLCC CSI Cost Estimate Summary'!P36","v":0},null,null,"False","","","","","","","","","","","","","","","",{"$f":"IF($S36=\"true\",#REF!,\"\")","v":""},""]
[{"$f":"'FLCC CSI Cost Estimate Summary'!A37:P37","v":"Contractor Scope/Trade Detail:"},null,null,null,null,null,null,null,null,null,null,null,null,null,null,null,"AEC PM Approval:",null,"False","","","","","","","","","","","","","","","",{"$f":"IF($S37=\"true\",#REF!,\"\")","v":""},""]
[{"$f":"'FLCC CSI Cost Estimate Summary'!A38:B41","v":0},null,{"$f":"'FLCC CSI Cost Estimate Summary'!C38:D38","v":"Name"},null,{"$f":"'FLCC CSI Cost Estimate Summary'!E38","v":false},{"$f":"'FLCC CSI Cost Estimate Summary'!F38","v":0},{"$f":"'FLCC CSI Cost Estimate Summary'!G38:H38","v":0},null,false,{"$f":"'FLCC CSI Cost Estimate Summary'!$J38","v":0},{"$f":"C38","v":"Name"},null,{"$f":"'FLCC CSI Cost Estimate Summary'!M38:N41","v":0},null,"Base Bid",{"$f":"'FLCC CSI Cost Estimate Summary'!P38","v":0},{"$f":"IF(S38=$S$1,SUM(P38:P41),0)","v":0},null,"False","","","","","","","","","","","","","","","",{"$f":"IF($S38=\"true\",#REF!,\"\")","v":""},""]
[null,null,{"$f":"'FLCC CSI Cost Estimate Summary'!C39:D39","v":"Name"},null,{"$f":"'FLCC CSI Cost Estimate Summary'!E39","v":false},{"$f":"'FLCC CSI Cost Estimate Summary'!F39","v":0},{"$f":"'FLCC CSI Cost Estimate Summary'!G39:H39","v":0},null,{"$f":"'FLCC CSI Cost Estimate Summary'!J39","v":0},{"$f":"'FLCC CSI Cost Estimate Summary'!$J39","v":0},null,null,null,null,"Alternate",{"$f":"'FLCC CSI Cost Estimate Summary'!P39","v":0},null,null,"False","","","","","","","","","","","","","","","",{"$f":"IF($S39=\"true\",#REF!,\"\")","v":""},""]
[null,null,{"$f":"'FLCC CSI Cost Estimate Summary'!C40:D40","v":"Name"},null,{"$f":"'FLCC CSI Cost Estimate Summary'!E40","v":false},{"$f":"'FLCC CSI Cost Estimate Summary'!F40","v":0},{"$f":"'FLCC CSI Cost Estimate Summary'!G40:H40","v":0},null,{"$f":"'FLCC CSI Cost Estimate Summary'!J40","v":0},{"$f":"'FLCC CSI Cost Estimate Summary'!$J40","v":0},null,null,null,null,"Alternate",{"$f":"'FLCC CSI Cost Estimate Summary'!P40","v":0},null,null,"False","","","","","","","","","","","","","","","",{"$f":"IF($S40=\"true\",#REF!,\"\")","v":""},""]
[null,null,{"$f":"'FLCC CSI Cost Estimate Summary'!C41:D41","v":"Name"},null,{"$f":"'FLCC CSI Cost Estimate Summary'!E41","v":false},{"$f":"'FLCC CSI Cost Estimate Summary'!F41","v":0},{"$f":"'FLCC CSI Cost Estimate Summary'!G41:H41","v":0},null,{"$f":"'FLCC CSI Cost Estimate Summary'!J41","v":0},{"$f":"'FLCC CSI Cost Estimate Summary'!$J41","v":0},null,null,null,null,"Alternate",{"$f":"'FLCC CSI Cost Estimate Summary'!P41","v":0},null,null,"False","","","",{"$f":"IF($S41=\"true\",\"A\",\"\")","v":""},"","",{"$f":"IF($S41=\"true\",\"A\",\"\")","v":""},"","","","","","","","",{"$f":"IF($S41=\"true\",#REF!,\"\")","v":""},""]
[{"$f":"'FLCC CSI Cost Estimate Summary'!A42:P42","v":"Contractor Scope/Trade Detail:"},null,null,null,null,null,null,null,null,null,null,null,null,null,null,null,"AEC PM Approval:",null,"False","","","","","","","","","","","","","","","",{"$f":"IF($S42=\"true\",#REF!,\"\")","v":""},""]
[{"$f":"'FLCC CSI Cost Estimate Summary'!A43:B46","v":0},null,{"$f":"'FLCC CSI Cost Estimate Summary'!C43:D43","v":"Name"},null,{"$f":"'FLCC CSI Cost Estimate Summary'!E43","v":false},{"$f":"'FLCC CSI Cost Estimate Summary'!F43","v":0},{"$f":"'FLCC CSI Cost Estimate Summary'!G43:H43","v":0},null,{"$f":"'FLCC CSI Cost Estimate Summary'!J43","v":0},{"$f":"'FLCC CSI Cost Estimate Summary'!$J43","v":0},{"$f":"C43","v":"Name"},null,{"$f":"'FLCC CSI Cost Estimate Summary'!M43:N46","v":0},null,"Base Bid",{"$f":"'FLCC CSI Cost Estimate Summary'!P43","v":0},{"$f":"IF(S43=$S$1,SUM(P43:P46),0)","v":0},null,"False","","","","","","","","","","","","","","","",{"$f":"IF($S43=\"true\",#REF!,\"\")","v":""},""]
[null,null,{"$f":"'FLCC CSI Cost Estimate Summary'!C44:D44","v":"Name"},null,{"$f":"'FLCC CSI Cost Estimate Summary'!E44","v":false},{"$f":"'FLCC CSI Cost Estimate Summary'!F44","v":0},{"$f":"'FLCC CSI Cost Estimate Summary'!G44:H44","v":0},null,{"$f":"'FLCC CSI Cost Estimate Summary'!J44","v":0},{"$f":"'FLCC CSI Cost Estimate Summary'!$J44","v":0},null,null,null,null,"Alternate",{"$f":"'FLCC CSI Cost Estimate Summary'!P44","v":0},null,null,"False","","","","","","","","","","","","","","","",{"$f":"IF($S44=\"true\",#REF!,\"\")","v":""},""]
[null,null,{"$f":"'FLCC CSI Cost Estimate Summary'!C45:D45","v":"Name"},null,{"$f":"'FLCC CSI Cost Estimate Summary'!E45","v":false},{"$f":"'FLCC CSI Cost Estimate Summary'!F45","v":0},{"$f":"'FLCC CSI Cost Estimate Summary'!G45:H45","v":0},null,{"$f":"'FLCC CSI Cost Estimate Summary'!J45","v":0},{"$f":"'FLCC CSI Cost Estimate Summary'!$J45","v":0},null,null,null,null,"Alternate",{"$f":"'FLCC CSI Cost Estimate Summary'!P45","v":0},null,null,"False","","","","","","","","","","","","","","","",{"$f":"IF($S45=\"true\",#REF!,\"\")","v":""},""]
[null,null,{"$f":"'FLCC CSI Cost Estimate Summary'!C46:D46","v":"Name"},null,{"$f":"'FLCC CSI Cost Estimate Summary'!E46","v":false},{"$f":"'FLCC CSI Cost Estimate Summary'!F46","v":0},{"$f":"'FLCC CSI Cost Estimate Summary'!G46:H46","v":0},null,{"$f":"'FLCC CSI Cost Estimate Summary'!J46","v":0},{"$f":"'FLCC CSI Cost Estimate Summary'!$J46","v":0},null,null,null,null,"Alternate",{"$f":"'FLCC CSI Cost Estimate Summary'!P46","v":0},null,null,"False","","","","","","","","","","","","","","","",{"$f":"IF($S46=\"true\",#REF!,\"\")","v":""},""]
[{"$f":"'FLCC CSI Cost Estimate Summary'!A47:P47","v":"Contractor Scope/Trade Detail:"},null,null,null,null,null,null,null,null,null,null,null,null,null,null,null,"AEC PM Approval:",null,"False","","","","","","","","","","","","","","","",{"$f":"IF($S47=\"true\",#REF!,\"\")","v":""},""]
[{"$f":"'FLCC CSI Cost Estimate Summary'!A48:B51","v":0},null,{"$f":"'FLCC CSI Cost Estimate Summary'!C48:D48","v":"Name"},null,{"$f":"'FLCC CSI Cost Estimate Summary'!E48","v":false},{"$f":"'FLCC CSI Cost Estimate Summary'!F48","v":0},{"$f":"'FLCC CSI Cost Estimate Summary'!G48:H48","v":0},null,{"$f":"'FLCC CSI Cost Estimate Summary'!J48","v":0},{"$f":"'FLCC CSI Cost Estimate Summary'!$J48","v":0},{"$f":"C48","v":"Name"},null,{"$f":"'FLCC CSI Cost Estimate Summary'!M48:N51","v":0},null,"Base Bid",{"$f":"'FLCC CSI Cost Estimate Summary'!P48","v":0},{"$f":"IF(S48=$S$1,SUM(P48:P51),0)","v":0},null,"False","","","","","","","","","","","","","","","",{"$f":"IF($S48=\"true\",#REF!,\"\")","v":""},""]
[null,null,{"$f":"'FLCC CSI Cost Estimate Summary'!C49:D49","v":"Name"},null,{"$f":"'FLCC CSI Cost Estimate Summary'!E49","v":false},{"$f":"'FLCC CSI Cost Estimate Summary'!F49","v":0},{"$f":"'FLCC CSI Cost Estimate Summary'!G49:H49","v":0},null,{"$f":"'FLCC CSI Cost Estimate Summary'!J49","v":0},{"$f":"'FLCC CSI Cost Estimate Summary'!$J49","v":0},null,null,null,null,"Alternate",{"$f":"'FLCC CSI Cost Estimate Summary'!P49","v":0},null,null,"False","","","","","","","","","","","","","","","",{"$f":"IF($S49=\"true\",#REF!,\"\")","v":""},""]
[null,null,{"$f":"'FLCC CSI Cost Estimate Summary'!C50:D50","v":"Name"},null,false,{"$f":"'FLCC CSI Cost Estimate Summary'!F50","v":0},{"$f":"'FLCC CSI Cost Estimate Summary'!G50:H50","v":0},null,{"$f":"'FLCC CSI Cost Estimate Summary'!J50","v":0},{"$f":"'FLCC CSI Cost Estimate Summary'!$J50","v":0},null,null,null,null,"Alternate",{"$f":"'FLCC CSI Cost Estimate Summary'!P50","v":0},null,null,"False","","","","","","","","","","","","","","",{"$f":"IF($S50=\"true\",#REF!,\"\")","v":""},{"$f":"IF($S50=\"true\",#REF!,\"\")","v":""},""]
[null,null,{"$f":"'FLCC CSI Cost Estimate Summary'!C51:D51","v":"Name"},null,false,{"$f":"'FLCC CSI Cost Estimate Summary'!F51","v":0},{"$f":"'FLCC CSI Cost Estimate Summary'!G51:H51","v":0},null,{"$f":"'FLCC CSI Cost Estimate Summary'!J51","v":0},{"$f":"'FLCC CSI Cost Estimate Summary'!$J51","v":0},null,null,null,null,"Alternate",{"$f":"'FLCC CSI Cost Estimate Summary'!P51","v":0},null,null,"False","","","","","","","","","","","","","",{"$f":"IF($S51=\"true\",#REF!,\"\")","v":""},{"$f":"IF($S51=\"true\",#REF!,\"\")","v":""},{"$f":"IF($S51=\"true\",#REF!,\"\")","v":""},""]
[{"$f":"'FLCC CSI Cost Estimate Summary'!A52:P52","v":"Contractor Scope/Trade Detail:"},null,null,null,null,null,null,null,null,null,null,null,null,null,null,null,"AEC PM Approval:",null,"False","","","","","","","","","","","","",{"$f":"IF($S52=\"true\",#REF!,\"\")","v":""},{"$f":"IF($S52=\"true\",#REF!,\"\")","v":""},{"$f":"IF($S52=\"true\",#REF!,\"\")","v":""},{"$f":"IF($S52=\"true\",#REF!,\"\")","v":""},""]
[{"$f":"'FLCC CSI Cost Estimate Summary'!A53:B56","v":0},null,{"$f":"'FLCC CSI Cost Estimate Summary'!C53:D53","v":"Name"},null,{"$f":"'FLCC CSI Cost Estimate Summary'!E53","v":false},{"$f":"'FLCC CSI Cost Estimate Summary'!F53","v":0},{"$f":"'FLCC CSI Cost Estimate Summary'!G53:H53","v":0},null,{"$f":"'FLCC CSI Cost Estimate Summary'!I53","v":0},{"$f":"'FLCC CSI Cost Estimate Summary'!$J53","v":0},{"$f":"C53","v":"Name"},null,{"$f":"'FLCC CSI Cost Estimate Summary'!M53:N56","v":0},null,"Base Bid",{"$f":"'FLCC CSI Cost Estimate Summary'!P53","v":0},{"$f":"IF(S53=$S$1,SUM(P53:P56),0)","v":0},null,"False","","","","","","","","","","",{"$f":"IF($S53=\"true\",M53,\"\")","v":""},{"$f":"IF($S53=\"true\",P53,\"\")","v":""},{"$f":"IF($S53=\"true\",P54,\"\")","v":""},{"$f":"IF($S53=\"true\",P55,\"\")","v":""},{"$f":"IF($S53=\"true\",P56,\"\")","v":""},{"$f":"IF($S53=\"true\",#REF!,\"\")","v":""},""]
[null,null,{"$f":"'FLCC CSI Cost Estimate Summary'!C54:D54","v":"Name"},null,{"$f":"'FLCC CSI Cost Estimate Summary'!E54","v":false},{"$f":"'FLCC CSI Cost Estimate Summary'!F54","v":0},{"$f":"'FLCC CSI Cost Estimate Summary'!G54:H54","v":0},null,{"$f":"'FLCC CSI Cost Estimate Summary'!I54","v":false},{"$f":"'FLCC CSI Cost Estimate Summary'!$J54","v":0},null,null,null,null,"Alternate",{"$f":"'FLCC CSI Cost Estimate Summary'!P54","v":0},null,null,"False","","","","","","","","","","",{"$f":"IF($S54=\"true\",M54,\"\")","v":""},{"$f":"IF($S54=\"true\",P54,\"\")","v":""},{"$f":"IF($S54=\"true\",P55,\"\")","v":""},{"$f":"IF($S54=\"true\",P56,\"\")","v":""},{"$f":"IF($S54=\"true\",P57,\"\")","v":""},{"$f":"IF($S54=\"true\",#REF!,\"\")","v":""},""]
[null,null,{"$f":"'FLCC CSI Cost Estimate Summary'!C55:D55","v":"Name"},null,{"$f":"'FLCC CSI Cost Estimate Summary'!E55","v":false},{"$f":"'FLCC CSI Cost Estimate Summary'!F55","v":0},{"$f":"'FLCC CSI Cost Estimate Summary'!G55:H55","v":0},null,{"$f":"'FLCC CSI Cost Estimate Summary'!I55","v":false},{"$f":"'FLCC CSI Cost Estimate Summary'!$J55","v":0},null,null,null,null,"Alternate",{"$f":"'FLCC CSI Cost Estimate Summary'!P55","v":0},null,null,"False","","","","","","","","","","",{"$f":"IF($S55=\"true\",M55,\"\")","v":""},{"$f":"IF($S55=\"true\",P55,\"\")","v":""},{"$f":"IF($S55=\"true\",P56,\"\")","v":""},{"$f":"IF($S55=\"true\",P57,\"\")","v":""},{"$f":"IF($S55=\"true\",#REF!,\"\")","v":""},{"$f":"IF($S55=\"true\",#REF!,\"\")","v":""},""]
[null,null,{"$f":"'FLCC CSI Cost Estimate Summary'!C56:D56","v":"Name"},null,{"$f":"'FLCC CSI Cost Estimate Summary'!E56","v":false},{"$f":"'FLCC CSI Cost Estimate Summary'!F56","v":0},{"$f":"'FLCC CSI Cost Estimate Summary'!G56:H56","v":0},null,{"$f":"'FLCC CSI Cost Estimate Summary'!I56","v":0},{"$f":"'FLCC CSI Cost Estimate Summary'!$J56","v":0},null,null,null,null,"Alternate",{"$f":"'FLCC CSI Cost Estimate Summary'!P56","v":0},null,null,"False","","","","","","","","","","",{"$f":"IF($S56=\"true\",M56,\"\")","v":""},{"$f":"IF($S56=\"true\",P56,\"\")","v":""},{"$f":"IF($S56=\"true\",P57,\"\")","v":""},{"$f":"IF($S56=\"true\",#REF!,\"\")","v":""},{"$f":"IF($S56=\"true\",#REF!,\"\")","v":""},{"$f":"IF($S56=\"true\",#REF!,\"\")","v":""},""]
[{"$f":"'FLCC CSI Cost Estimate Summary'!A57:P57","v":"Contractor Scope/Trade Detail:"},null,null,null,null,null,null,null,null,null,null,null,null,null,null,null,"AEC PM Approval:",null,"False","","","","","","","","","","",null,null,null,null,null,null,""]
[{"$f":"'FLCC CSI Cost Estimate Summary'!A58:B61","v":0},null,{"$f":"'FLCC CSI Cost Estimate Summary'!C58:D58","v":"Name"},null,{"$f":"'FLCC CSI Cost Estimate Summary'!E58","v":false},{"$f":"'FLCC CSI Cost Estimate Summary'!F58","v":0},{"$f":"'FLCC CSI Cost Estimate Summary'!G58:H58","v":0},null,{"$f":"'FLCC CSI Cost Estimate Summary'!I58","v":0},{"$f":"'FLCC CSI Cost Estimate Summary'!$J58","v":0},{"$f":"C58","v":"Name"},null,{"$f":"'FLCC CSI Cost Estimate Summary'!M58:N61","v":0},null,"Base Bid",{"$f":"'FLCC CSI Cost Estimate Summary'!P58","v":0},{"$f":"IF(S58=$S$1,SUM(P58:P61),0)","v":0},null,"False","","","","","","","","","","",{"$f":"IF($S58=\"true\",M58,\"\")","v":""},{"$f":"IF($S58=\"true\",P58,\"\")","v":""},{"$f":"IF($S58=\"true\",P59,\"\")","v":""},{"$f":"IF($S58=\"true\",P60,\"\")","v":""},{"$f":"IF($S58=\"true\",P61,\"\")","v":""},{"$f":"IF($S58=\"true\",#REF!,\"\")","v":""},""]
[null,null,{"$f":"'FLCC CSI Cost Estimate Summary'!C59:D59","v":"Name"},null,{"$f":"'FLCC CSI Cost Estimate Summary'!E59","v":false},{"$f":"'FLCC CSI Cost Estimate Summary'!F59","v":0},{"$f":"'FLCC CSI Cost Estimate Summary'!G59:H59","v":0},null,{"$f":"'FLCC CSI Cost Estimate Summary'!I59","v":false},{"$f":"'FLCC CSI Cost Estimate Summary'!$J59","v":0},null,null,null,null,"Alternate",{"$f":"'FLCC CSI Cost Estimate Summary'!P59","v":0},null,null,"False","","","","","","","","","","",{"$f":"IF($S59=\"true\",M59,\"\")","v":""},{"$f":"IF($S59=\"true\",P59,\"\")","v":""},{"$f":"IF($S59=\"true\",P60,\"\")","v":""},{"$f":"IF($S59=\"true\",P61,\"\")","v":""},{"$f":"IF($S59=\"true\",P62,\"\")","v":""},{"$f":"IF($S59=\"true\",#REF!,\"\")","v":""},""]
[null,null,{"$f":"'FLCC CSI Cost Estimate Summary'!C60:D60","v":"Name"},null,{"$f":"'FLCC CSI Cost Estimate Summary'!E60","v":false},{"$f":"'FLCC CSI Cost Estimate Summary'!F60","v":0},{"$f":"'FLCC CSI Cost Estimate Summary'!G60:H60","v":0},null,{"$f":"'FLCC CSI Cost Estimate Summary'!I60","v":false},{"$f":"'FLCC CSI Cost Estimate Summary'!$J60","v":0},null,null,null,null,"Alternate",{"$f":"'FLCC CSI Cost Estimate Summary'!P60","v":0},null,null,"False","","","","","","","","","","",{"$f":"IF($S60=\"true\",M60,\"\")","v":""},{"$f":"IF($S60=\"true\",P60,\"\")","v":""},{"$f":"IF($S60=\"true\",P61,\"\")","v":""},{"$f":"IF($S60=\"true\",P62,\"\")","v":""},{"$f":"IF($S60=\"true\",#REF!,\"\")","v":""},{"$f":"IF($S60=\"true\",#REF!,\"\")","v":""},""]
[null,null,{"$f":"'FLCC CSI Cost Estimate Summary'!C61:D61","v":"Name"},null,{"$f":"'FLCC CSI Cost Estimate Summary'!E61","v":false},{"$f":"'FLCC CSI Cost Estimate Summary'!F61","v":0},{"$f":"'FLCC CSI Cost Estimate Summary'!G61:H61","v":0},null,{"$f":"'FLCC CSI Cost Estimate Summary'!I61","v":0},{"$f":"'FLCC CSI Cost Estimate Summary'!$J61","v":0},null,null,null,null,"Alternate",{"$f":"'FLCC CSI Cost Estimate Summary'!P61","v":0},null,null,"False","","","","","","","","","","",{"$f":"IF($S61=\"true\",M61,\"\")","v":""},{"$f":"IF($S61=\"true\",P61,\"\")","v":""},{"$f":"IF($S61=\"true\",P62,\"\")","v":""},{"$f":"IF($S61=\"true\",#REF!,\"\")","v":""},{"$f":"IF($S61=\"true\",#REF!,\"\")","v":""},{"$f":"IF($S61=\"true\",#REF!,\"\")","v":""},""]
[{"$f":"'FLCC CSI Cost Estimate Summary'!A62:P62","v":"Contractor Scope/Trade Detail:"},null,null,null,null,null,null,null,null,null,null,null,null,null,null,null,"AEC PM Approval:",null,"False","","","","","","","","","","",null,null,null,null,null,null,""]
[{"$f":"'FLCC CSI Cost Estimate Summary'!A63:B66","v":0},null,{"$f":"'FLCC CSI Cost Estimate Summary'!C63:D63","v":"Name"},null,{"$f":"'FLCC CSI Cost Estimate Summary'!E63","v":false},{"$f":"'FLCC CSI Cost Estimate Summary'!F63","v":0},{"$f":"'FLCC CSI Cost Estimate Summary'!G63:H63","v":0},null,{"$f":"'FLCC CSI Cost Estimate Summary'!I63","v":0},{"$f":"'FLCC CSI Cost Estimate Summary'!$J63","v":0},{"$f":"C63","v":"Name"},null,{"$f":"'FLCC CSI Cost Estimate Summary'!M63:N66","v":0},null,"Base Bid",{"$f":"'FLCC CSI Cost Estimate Summary'!P63","v":0},{"$f":"IF(S63=$S$1,SUM(P63:P66),0)","v":0},null,"False","","","","","","","","","","",{"$f":"IF($S63=\"true\",M63,\"\")","v":""},{"$f":"IF($S63=\"true\",P63,\"\")","v":""},{"$f":"IF($S63=\"true\",P64,\"\")","v":""},{"$f":"IF($S63=\"true\",P65,\"\")","v":""},{"$f":"IF($S63=\"true\",P66,\"\")","v":""},{"$f":"IF($S63=\"true\",#REF!,\"\")","v":""},""]
[null,null,{"$f":"'FLCC CSI Cost Estimate Summary'!C64:D64","v":"Name"},null,{"$f":"'FLCC CSI Cost Estimate Summary'!E64","v":false},{"$f":"'FLCC CSI Cost Estimate Summary'!F64","v":0},{"$f":"'FLCC CSI Cost Estimate Summary'!G64:H64","v":0},null,{"$f":"'FLCC CSI Cost Estimate Summary'!I64","v":false},{"$f":"'FLCC CSI Cost Estimate Summary'!$J64","v":0},null,null,null,null,"Alternate",{"$f":"'FLCC CSI Cost Estimate Summary'!P64","v":0},null,null,"False","","","","","","","","","","",{"$f":"IF($S64=\"true\",M64,\"\")","v":""},{"$f":"IF($S64=\"true\",P64,\"\")","v":""},{"$f":"IF($S64=\"true\",P65,\"\")","v":""},{"$f":"IF($S64=\"true\",P66,\"\")","v":""},{"$f":"IF($S64=\"true\",P67,\"\")","v":""},{"$f":"IF($S64=\"true\",#REF!,\"\")","v":""},""]
[null,null,{"$f":"'FLCC CSI Cost Estimate Summary'!C65:D65","v":"Name"},null,{"$f":"'FLCC CSI Cost Estimate Summary'!E65","v":false},{"$f":"'FLCC CSI Cost Estimate Summary'!F65","v":0},{"$f":"'FLCC CSI Cost Estimate Summary'!G65:H65","v":0},null,{"$f":"'FLCC CSI Cost Estimate Summary'!I65","v":false},{"$f":"'FLCC CSI Cost Estimate Summary'!$J65","v":false},null,null,null,null,"Alternate",{"$f":"'FLCC CSI Cost Estimate Summary'!P65","v":0},null,null,"False","","","","","","","","","","",{"$f":"IF($S65=\"true\",M65,\"\")","v":""},{"$f":"IF($S65=\"true\",P65,\"\")","v":""},{"$f":"IF($S65=\"true\",P66,\"\")","v":""},{"$f":"IF($S65=\"true\",P67,\"\")","v":""},{"$f":"IF($S65=\"true\",#REF!,\"\")","v":""},{"$f":"IF($S65=\"true\",#REF!,\"\")","v":""},{"$f":"IF($S65=\"true\",SUM(P65:P103),\"\")","v":""}]
[null,null,{"$f":"'FLCC CSI Cost Estimate Summary'!C66:D66","v":"Name"},null,{"$f":"'FLCC CSI Cost Estimate Summary'!E66","v":false},{"$f":"'FLCC CSI Cost Estimate Summary'!F66","v":0},{"$f":"'FLCC CSI Cost Estimate Summary'!G66:H66","v":0},null,{"$f":"'FLCC CSI Cost Estimate Summary'!I66","v":0},{"$f":"'FLCC CSI Cost Estimate Summary'!$J66","v":0},null,null,null,null,"Alternate",{"$f":"'FLCC CSI Cost Estimate Summary'!P66","v":0},null,null,"False","","","","","","","","","","",{"$f":"IF($S66=\"true\",M66,\"\")","v":""},{"$f":"IF($S66=\"true\",P66,\"\")","v":""},{"$f":"IF($S66=\"true\",P67,\"\")","v":""},{"$f":"IF($S66=\"true\",#REF!,\"\")","v":""},{"$f":"IF($S66=\"true\",#REF!,\"\")","v":""},{"$f":"IF($S66=\"true\",#REF!,\"\")","v":""},{"$f":"IF($S66=\"true\",SUM(P66:P104),\"\")","v":""}]
[{"$f":"'FLCC CSI Cost Estimate Summary'!A67:P67","v":"Contractor Scope/Trade Detail:"},null,null,null,null,null,null,null,null,null,null,null,null,null,null,null,"AEC PM Approval:",null,"False","","","","","","","","","","",null,null,null,null,null,null,{"$f":"IF($S67=\"true\",SUM(P67:P105),\"\")","v":""}]
[{"$f":"'FLCC CSI Cost Estimate Summary'!A68:B71","v":0},null,{"$f":"'FLCC CSI Cost Estimate Summary'!C68:D68","v":"Name"},null,{"$f":"'FLCC CSI Cost Estimate Summary'!E68","v":false},{"$f":"'FLCC CSI Cost Estimate Summary'!F68","v":0},{"$f":"'FLCC CSI Cost Estimate Summary'!G68:H68","v":0},null,false,{"$f":"'FLCC CSI Cost Estimate Summary'!$J68","v":0},{"$f":"C68","v":"Name"},null,{"$f":"'FLCC CSI Cost Estimate Summary'!M68:N71","v":0},null,"Base Bid",{"$f":"'FLCC CSI Cost Estimate Summary'!P68","v":0},{"$f":"IF(S68=$S$1,SUM(P68:P71),0)","v":0},null,"False","","","","","","","","","","",{"$f":"IF($S68=\"true\",M68,\"\")","v":""},{"$f":"IF($S68=\"true\",P68,\"\")","v":""},{"$f":"IF($S68=\"true\",P69,\"\")","v":""},{"$f":"IF($S68=\"true\",P70,\"\")","v":""},{"$f":"IF($S68=\"true\",P71,\"\")","v":""},{"$f":"IF($S68=\"true\",#REF!,\"\")","v":""},{"$f":"IF($S68=\"true\",SUM(P68:P71),\"\")","v":""}]
[null,null,{"$f":"'FLCC CSI Cost Estimate Summary'!C69:D69","v":"Name"},null,{"$f":"'FLCC CSI Cost Estimate Summary'!E69","v":false},{"$f":"'FLCC CSI Cost Estimate Summary'!F69","v":0},{"$f":"'FLCC CSI Cost Estimate Summary'!G69:H69","v":0},null,null,{"$f":"'FLCC CSI Cost Estimate Summary'!$J69","v":0},null,null,null,null,"Alternate",{"$f":"'FLCC CSI Cost Estimate Summary'!P69","v":0},null,null,"False","","","","","","","","","","",{"$f":"IF($S69=\"true\",M69,\"\")","v":""},{"$f":"IF($S69=\"true\",P69,\"\")","v":""},{"$f":"IF($S69=\"true\",P70,\"\")","v":""},{"$f":"IF($S69=\"true\",P71,\"\")","v":""},{"$f":"IF($S69=\"true\",P72,\"\")","v":""},{"$f":"IF($S69=\"true\",#REF!,\"\")","v":""},{"$f":"IF($S69=\"true\",SUM(P69:P72),\"\")","v":""}]
[null,null,{"$f":"'FLCC CSI Cost Estimate Summary'!C70:D70","v":"Name"},null,{"$f":"'FLCC CSI Cost Estimate Summary'!E70","v":false},{"$f":"'FLCC CSI Cost Estimate Summary'!F70","v":0},{"$f":"'FLCC CSI Cost Estimate Summary'!G70:H70","v":0},null,false,{"$f":"'FLCC CSI Cost Estimate Summary'!$J70","v":false},null,null,null,null,"Alternate",{"$f":"'FLCC CSI Cost Estimate Summary'!P70","v":0},null,null,"False","","","","","","","","","","",{"$f":"IF($S70=\"true\",M70,\"\")","v":""},{"$f":"IF($S70=\"true\",P70,\"\")","v":""},{"$f":"IF($S70=\"true\",P71,\"\")","v":""},{"$f":"IF($S70=\"true\",P72,\"\")","v":""},{"$f":"IF($S70=\"true\",#REF!,\"\")","v":""},{"$f":"IF($S70=\"true\",#REF!,\"\")","v":""},{"$f":"IF($S70=\"true\",SUM(P70:P108),\"\")","v":""}]
[null,null,{"$f":"'FLCC CSI Cost Estimate Summary'!C71:D71","v":"Name"},null,{"$f":"'FLCC CSI Cost Estimate Summary'!E71","v":false},{"$f":"'FLCC CSI Cost Estimate Summary'!F71","v":0},{"$f":"'FLCC CSI Cost Estimate Summary'!G71:H71","v":0},null,null,{"$f":"'FLCC CSI Cost Estimate Summary'!$J71","v":0},null,null,null,null,"Alternate",{"$f":"'FLCC CSI Cost Estimate Summary'!P71","v":0},null,null,"False","","","","","","","","","","",{"$f":"IF($S71=\"true\",M71,\"\")","v":""},{"$f":"IF($S71=\"true\",P71,\"\")","v":""},{"$f":"IF($S71=\"true\",P72,\"\")","v":""},{"$f":"IF($S71=\"true\",#REF!,\"\")","v":""},{"$f":"IF($S71=\"true\",#REF!,\"\")","v":""},{"$f":"IF($S71=\"true\",#REF!,\"\")","v":""},{"$f":"IF($S71=\"true\",SUM(P71:P109),\"\")","v":""}]
[{"$f":"'FLCC CSI Cost Estimate Summary'!A72:P72","v":"Contractor Scope/Trade Detail:"},null,null,null,null,null,null,null,null,null,null,null,null,null,null,null,"AEC PM Approval:",null,"False","","","","","","","","","","",null,null,null,null,null,null,{"$f":"IF($S72=\"true\",SUM(P72:P110),\"\")","v":""}]
[{"$f":"'FLCC CSI Cost Estimate Summary'!A73:B76","v":0},null,{"$f":"'FLCC CSI Cost Estimate Summary'!C73:D73","v":"Name"},null,{"$f":"'FLCC CSI Cost Estimate Summary'!E73","v":false},{"$f":"'FLCC CSI Cost Estimate Summary'!F73","v":0},{"$f":"'FLCC CSI Cost Estimate Summary'!G73:H73","v":0},null,false,{"$f":"'FLCC CSI Cost Estimate Summary'!$J73","v":0},{"$f":"C73","v":"Name"},null,{"$f":"'FLCC CSI Cost Estimate Summary'!M73:N76","v":0},null,"Base Bid",{"$f":"'FLCC CSI Cost Estimate Summary'!P73","v":0},{"$f":"IF(S73=$S$1,SUM(P73:P76),0)","v":0},null,"False","","","","","","","","","","",{"$f":"IF($S73=\"true\",M73,\"\")","v":""},{"$f":"IF($S73=\"true\",P73,\"\")","v":""},{"$f":"IF($S73=\"true\",P74,\"\")","v":""},{"$f":"IF($S73=\"true\",P75,\"\")","v":""},{"$f":"IF($S73=\"true\",P76,\"\")","v":""},{"$f":"IF($S73=\"true\",#REF!,\"\")","v":""},{"$f":"IF($S73=\"true\",SUM(P73:P76),\"\")","v":""}]
[null,null,{"$f":"'FLCC CSI Cost Estimate Summary'!C74:D74","v":"Name"},null,{"$f":"'FLCC CSI Cost Estimate Summary'!E74","v":false},{"$f":"'FLCC CSI Cost Estimate Summary'!F74","v":0},{"$f":"'FLCC CSI Cost Estimate Summary'!G74:H74","v":0},null,null,{"$f":"'FLCC CSI Cost Estimate Summary'!$J74","v":0},null,null,null,null,"Alternate",{"$f":"'FLCC CSI Cost Estimate Summary'!P74","v":0},null,null,"False","","","","","","","","","","",{"$f":"IF($S74=\"true\",M74,\"\")","v":""},{"$f":"IF($S74=\"true\",P74,\"\")","v":""},{"$f":"IF($S74=\"true\",P75,\"\")","v":""},{"$f":"IF($S74=\"true\",P76,\"\")","v":""},{"$f":"IF($S74=\"true\",P77,\"\")","v":""},{"$f":"IF($S74=\"true\",#REF!,\"\")","v":""},{"$f":"IF($S74=\"true\",SUM(P74:P77),\"\")","v":""}]
[null,null,{"$f":"'FLCC CSI Cost Estimate Summary'!C75:D75","v":"Name"},null,{"$f":"'FLCC CSI Cost Estimate Summary'!E75","v":false},{"$f":"'FLCC CSI Cost Estimate Summary'!F75","v":0},{"$f":"'FLCC CSI Cost Estimate Summary'!G75:H75","v":0},null,false,{"$f":"'FLCC CSI Cost Estimate Summary'!$J75","v":false},null,null,null,null,"Alternate",{"$f":"'FLCC CSI Cost Estimate Summary'!P75","v":0},null,null,"False","","","","","","","","","","",{"$f":"IF($S75=\"true\",M75,\"\")","v":""},{"$f":"IF($S75=\"true\",P75,\"\")","v":""},{"$f":"IF($S75=\"true\",P76,\"\")","v":""},{"$f":"IF($S75=\"true\",P77,\"\")","v":""},{"$f":"IF($S75=\"true\",#REF!,\"\")","v":""},{"$f":"IF($S75=\"true\",#REF!,\"\")","v":""},{"$f":"IF($S75=\"true\",SUM(P75:P108),\"\")","v":""}]
[null,null,{"$f":"'FLCC CSI Cost Estimate Summary'!C76:D76","v":"Name"},null,{"$f":"'FLCC CSI Cost Estimate Summary'!E76","v":false},{"$f":"'FLCC CSI Cost Estimate Summary'!F76","v":0},{"$f":"'FLCC CSI Cost Estimate Summary'!G76:H76","v":0},null,null,{"$f":"'FLCC CSI Cost Estimate Summary'!$J76","v":0},null,null,null,null,"Alternate",{"$f":"'FLCC CSI Cost Estimate Summary'!P76","v":0},null,null,"False","","","","","","","","","","",{"$f":"IF($S76=\"true\",M76,\"\")","v":""},{"$f":"IF($S76=\"true\",P76,\"\")","v":""},{"$f":"IF($S76=\"true\",P77,\"\")","v":""},{"$f":"IF($S76=\"true\",#REF!,\"\")","v":""},{"$f":"IF($S76=\"true\",#REF!,\"\")","v":""},{"$f":"IF($S76=\"true\",#REF!,\"\")","v":""},{"$f":"IF($S76=\"true\",SUM(P76:P109),\"\")","v":""}]
[{"$f":"'FLCC CSI Cost Estimate Summary'!A77:P77","v":"Contractor Scope/Trade Detail:"},null,null,null,null,null,null,null,null,null,null,null,null,null,null,null,"AEC PM Approval:",null,"False","","","","","","","","","","",null,null,null,null,null,null,{"$f":"IF($S77=\"true\",SUM(P77:P110),\"\")","v":""}]
[{"$f":"'FLCC CSI Cost Estimate Summary'!A78:B81","v":0},null,{"$f":"'FLCC CSI Cost Estimate Summary'!C78:D78","v":"Name"},null,{"$f":"'FLCC CSI Cost Estimate Summary'!E78","v":false},{"$f":"'FLCC CSI Cost Estimate Summary'!F78","v":0},{"$f":"'FLCC CSI Cost Estimate Summary'!G78:H78","v":0},null,null,{"$f":"'FLCC CSI Cost Estimate Summary'!$J78","v":0},{"$f":"C78","v":"Name"},null,{"$f":"'FLCC CSI Cost Estimate Summary'!M78:N81","v":0},null,"Base Bid",{"$f":"'FLCC CSI Cost Estimate Summary'!P78","v":0},{"$f":"IF(S78=$S$1,SUM(P78:P81),0)","v":0},null,"False","","","","","","","","","","",{"$f":"IF($S78=\"true\",M78,\"\")","v":""},{"$f":"IF($S78=\"true\",P78,\"\")","v":""},{"$f":"IF($S78=\"true\",P79,\"\")","v":""},{"$f":"IF($S78=\"true\",P80,\"\")","v":""},{"$f":"IF($S78=\"true\",P81,\"\")","v":""},{"$f":"IF($S78=\"true\",#REF!,\"\")","v":""},{"$f":"IF($S78=\"true\",SUM(P78:P81),\"\")","v":""}]
[null,null,{"$f":"'FLCC CSI Cost Estimate Summary'!C79:D79","v":"Name"},null,{"$f":"'FLCC CSI Cost Estimate Summary'!E79","v":false},{"$f":"'FLCC CSI Cost Estimate Summary'!F79","v":0},{"$f":"'FLCC CSI Cost Estimate Summary'!G79:H79","v":0},null,null,{"$f":"'FLCC CSI Cost Estimate Summary'!$J79","v":0},null,null,null,null,"Alternate",{"$f":"'FLCC CSI Cost Estimate Summary'!P79","v":0},null,null,"False","","","","","","","","","","",{"$f":"IF($S79=\"true\",M79,\"\")","v":""},{"$f":"IF($S79=\"true\",P79,\"\")","v":""},{"$f":"IF($S79=\"true\",P80,\"\")","v":""},{"$f":"IF($S79=\"true\",P81,\"\")","v":""},{"$f":"IF($S79=\"true\",P82,\"\")","v":""},{"$f":"IF($S79=\"true\",#REF!,\"\")","v":""},{"$f":"IF($S79=\"true\",SUM(P79:P82),\"\")","v":""}]
[null,null,{"$f":"'FLCC CSI Cost Estimate Summary'!C80:D80","v":"Name"},null,{"$f":"'FLCC CSI Cost Estimate Summary'!E80","v":false},{"$f":"'FLCC CSI Cost Estimate Summary'!F80","v":0},{"$f":"'FLCC CSI Cost Estimate Summary'!G80:H80","v":0},null,false,{"$f":"'FLCC CSI Cost Estimate Summary'!$J80","v":false},null,null,null,null,"Alternate",{"$f":"'FLCC CSI Cost Estimate Summary'!P80","v":0},null,null,"False","","","","","","","","","","",{"$f":"IF($S80=\"true\",M80,\"\")","v":""},{"$f":"IF($S80=\"true\",P80,\"\")","v":""},{"$f":"IF($S80=\"true\",P81,\"\")","v":""},{"$f":"IF($S80=\"true\",P82,\"\")","v":""},{"$f":"IF($S80=\"true\",#REF!,\"\")","v":""},{"$f":"IF($S80=\"true\",#REF!,\"\")","v":""},{"$f":"IF($S80=\"true\",SUM(P80:P108),\"\")","v":""}]
[null,null,{"$f":"'FLCC CSI Cost Estimate Summary'!C81:D81","v":"Name"},null,{"$f":"'FLCC CSI Cost Estimate Summary'!E81","v":false},{"$f":"'FLCC CSI Cost Estimate Summary'!F81","v":0},{"$f":"'FLCC CSI Cost Estimate Summary'!G81:H81","v":0},null,null,{"$f":"'FLCC CSI Cost Estimate Summary'!$J81","v":0},null,null,null,null,"Alternate",{"$f":"'FLCC CSI Cost Estimate Summary'!P81","v":0},null,null,"False","","","","","","","","","","",{"$f":"IF($S81=\"true\",M81,\"\")","v":""},{"$f":"IF($S81=\"true\",P81,\"\")","v":""},{"$f":"IF($S81=\"true\",P82,\"\")","v":""},{"$f":"IF($S81=\"true\",#REF!,\"\")","v":""},{"$f":"IF($S81=\"true\",#REF!,\"\")","v":""},{"$f":"IF($S81=\"true\",#REF!,\"\")","v":""},{"$f":"IF($S81=\"true\",SUM(P81:P109),\"\")","v":""}]
[{"$f":"'FLCC CSI Cost Estimate Summary'!A82:P82","v":"Contractor Scope/Trade Detail:"},null,null,null,null,null,null,null,null,null,null,null,null,null,null,null,"AEC PM Approval:",null,"False","","","","","","","","","","",null,null,null,null,null,null,{"$f":"IF($S82=\"true\",SUM(P82:P110),\"\")","v":""}]
[{"$f":"'FLCC CSI Cost Estimate Summary'!A83:B86","v":0},null,{"$f":"'FLCC CSI Cost Estimate Summary'!C83:D83","v":"Name"},null,{"$f":"'FLCC CSI Cost Estimate Summary'!E83","v":false},{"$f":"'FLCC CSI Cost Estimate Summary'!F83","v":0},{"$f":"'FLCC CSI Cost Estimate Summary'!G83:H83","v":0},null,null,{"$f":"'FLCC CSI Cost Estimate Summary'!$J83","v":0},{"$f":"C83","v":"Name"},null,{"$f":"'FLCC CSI Cost Estimate Summary'!M83:N86","v":0},null,"Base Bid",{"$f":"'FLCC CSI Cost Estimate Summary'!P83","v":0},{"$f":"IF(S83=$S$1,SUM(P83:P86),0)","v":0},null,"False","","","","","","","","","","",{"$f":"IF($S83=\"true\",M83,\"\")","v":""},{"$f":"IF($S83=\"true\",P83,\"\")","v":""},{"$f":"IF($S83=\"true\",P84,\"\")","v":""},{"$f":"IF($S83=\"true\",P85,\"\")","v":""},{"$f":"IF($S83=\"true\",P86,\"\")","v":""},{"$f":"IF($S83=\"true\",#REF!,\"\")","v":""},{"$f":"IF($S83=\"true\",SUM(P83:P86),\"\")","v":""}]
[null,null,{"$f":"'FLCC CSI Cost Estimate Summary'!C84:D84","v":"Name"},null,{"$f":"'FLCC CSI Cost Estimate Summary'!E84","v":false},{"$f":"'FLCC CSI Cost Estimate Summary'!F84","v":0},{"$f":"'FLCC CSI Cost Estimate Summary'!G84:H84","v":0},null,null,{"$f":"'FLCC CSI Cost Estimate Summary'!$J84","v":0},null,null,null,null,"Alternate",{"$f":"'FLCC CSI Cost Estimate Summary'!P84","v":0},null,null,"False","","","","","","","","","","",{"$f":"IF($S84=\"true\",M84,\"\")","v":""},{"$f":"IF($S84=\"true\",P84,\"\")","v":""},{"$f":"IF($S84=\"true\",P85,\"\")","v":""},{"$f":"IF($S84=\"true\",P86,\"\")","v":""},{"$f":"IF($S84=\"true\",P87,\"\")","v":""},{"$f":"IF($S84=\"true\",#REF!,\"\")","v":""},{"$f":"IF($S84=\"true\",SUM(P84:P87),\"\")","v":""}]
[null,null,{"$f":"'FLCC CSI Cost Estimate Summary'!C85:D85","v":"Name"},null,{"$f":"'FLCC CSI Cost Estimate Summary'!E85","v":false},{"$f":"'FLCC CSI Cost Estimate Summary'!F85","v":0},{"$f":"'FLCC CSI Cost Estimate Summary'!G85:H85","v":0},null,false,{"$f":"'FLCC CSI Cost Estimate Summary'!$J85","v":false},null,null,null,null,"Alternate",{"$f":"'FLCC CSI Cost Estimate Summary'!P85","v":0},null,null,"False","","","","","","","","","","",{"$f":"IF($S85=\"true\",M85,\"\")","v":""},{"$f":"IF($S85=\"true\",P85,\"\")","v":""},{"$f":"IF($S85=\"true\",P86,\"\")","v":""},{"$f":"IF($S85=\"true\",P87,\"\")","v":""},{"$f":"IF($S85=\"true\",#REF!,\"\")","v":""},{"$f":"IF($S85=\"true\",#REF!,\"\")","v":""},{"$f":"IF($S85=\"true\",SUM(P85:P108),\"\")","v":""}]
[null,null,{"$f":"'FLCC CSI Cost Estimate Summary'!C86:D86","v":"Name"},null,{"$f":"'FLCC CSI Cost Estimate Summary'!E86","v":false},{"$f":"'FLCC CSI Cost Estimate Summary'!F86","v":0},{"$f":"'FLCC CSI Cost Estimate Summary'!G86:H86","v":0},null,null,{"$f":"'FLCC CSI Cost Estimate Summary'!$J86","v":0},null,null,null,null,"Alternate",{"$f":"'FLCC CSI Cost Estimate Summary'!P86","v":0},null,null,"False","","","","","","","","","","",{"$f":"IF($S86=\"true\",M86,\"\")","v":""},{"$f":"IF($S86=\"true\",P86,\"\")","v":""},{"$f":"IF($S86=\"true\",P87,\"\")","v":""},{"$f":"IF($S86=\"true\",#REF!,\"\")","v":""},{"$f":"IF($S86=\"true\",#REF!,\"\")","v":""},{"$f":"IF($S86=\"true\",#REF!,\"\")","v":""},{"$f":"IF($S86=\"true\",SUM(P86:P109),\"\")","v":""}]
[{"$f":"'FLCC CSI Cost Estimate Summary'!A87:P87","v":"Contractor Scope/Trade Detail:"},null,null,null,null,null,null,null,null,null,null,null,null,null,null,null,"AEC PM Approval:",null,"False","","","","","","","","","","",null,null,null,null,null,null,{"$f":"IF($S87=\"true\",SUM(P87:P110),\"\")","v":""}]
[{"$f":"'FLCC CSI Cost Estimate Summary'!A88:B91","v":0},null,{"$f":"'FLCC CSI Cost Estimate Summary'!C88:D88","v":"Name"},null,{"$f":"'FLCC CSI Cost Estimate Summary'!E88","v":false},{"$f":"'FLCC CSI Cost Estimate Summary'!F88","v":0},{"$f":"'FLCC CSI Cost Estimate Summary'!G88:H88","v":0},null,null,{"$f":"'FLCC CSI Cost Estimate Summary'!$J88","v":0},{"$f":"C88","v":"Name"},null,{"$f":"'FLCC CSI Cost Estimate Summary'!M88:N91","v":0},null,"Base Bid",{"$f":"'FLCC CSI Cost Estimate Summary'!P88","v":0},{"$f":"IF(S88=$S$1,SUM(P88:P91),0)","v":0},null,"False","","","","","","","","","","",{"$f":"IF($S88=\"true\",M88,\"\")","v":""},{"$f":"IF($S88=\"true\",P88,\"\")","v":""},{"$f":"IF($S88=\"true\",P89,\"\")","v":""},{"$f":"IF($S88=\"true\",P90,\"\")","v":""},{"$f":"IF($S88=\"true\",P91,\"\")","v":""},{"$f":"IF($S88=\"true\",#REF!,\"\")","v":""},{"$f":"IF($S88=\"true\",SUM(P88:P91),\"\")","v":""}]
[null,null,{"$f":"'FLCC CSI Cost Estimate Summary'!C89:D89","v":"Name"},null,{"$f":"'FLCC CSI Cost Estimate Summary'!E89","v":false},{"$f":"'FLCC CSI Cost Estimate Summary'!F89","v":0},{"$f":"'FLCC CSI Cost Estimate Summary'!G89:H89","v":0},null,null,{"$f":"'FLCC CSI Cost Estimate Summary'!$J89","v":0},null,null,null,null,"Alternate",{"$f":"'FLCC CSI Cost Estimate Summary'!P89","v":0},null,null,"False","","","","","","","","","","",{"$f":"IF($S89=\"true\",M89,\"\")","v":""},{"$f":"IF($S89=\"true\",P89,\"\")","v":""},{"$f":"IF($S89=\"true\",P90,\"\")","v":""},{"$f":"IF($S89=\"true\",P91,\"\")","v":""},{"$f":"IF($S89=\"true\",P92,\"\")","v":""},{"$f":"IF($S89=\"true\",#REF!,\"\")","v":""},{"$f":"IF($S89=\"true\",SUM(P89:P92),\"\")","v":""}]
[null,null,{"$f":"'FLCC CSI Cost Estimate Summary'!C90:D90","v":"Name"},null,{"$f":"'FLCC CSI Cost Estimate Summary'!E90","v":false},{"$f":"'FLCC CSI Cost Estimate Summary'!F90","v":0},{"$f":"'FLCC CSI Cost Estimate Summary'!G90:H90","v":0},null,false,{"$f":"'FLCC CSI Cost Estimate Summary'!$J90","v":false},null,null,null,null,"Alternate",{"$f":"'FLCC CSI Cost Estimate Summary'!P90","v":0},null,null,"False","","","","","","","","","","",{"$f":"IF($S90=\"true\",M90,\"\")","v":""},{"$f":"IF($S90=\"true\",P90,\"\")","v":""},{"$f":"IF($S90=\"true\",P91,\"\")","v":""},{"$f":"IF($S90=\"true\",P92,\"\")","v":""},{"$f":"IF($S90=\"true\",#REF!,\"\")","v":""},{"$f":"IF($S90=\"true\",#REF!,\"\")","v":""},{"$f":"IF($S90=\"true\",SUM(P90:P108),\"\")","v":""}]
[null,null,{"$f":"'FLCC CSI Cost Estimate Summary'!C91:D91","v":"Name"},null,{"$f":"'FLCC CSI Cost Estimate Summary'!E91","v":false},{"$f":"'FLCC CSI Cost Estimate Summary'!F91","v":0},{"$f":"'FLCC CSI Cost Estimate Summary'!G91:H91","v":0},null,null,{"$f":"'FLCC CSI Cost Estimate Summary'!$J91","v":0},null,null,null,null,"Alternate",{"$f":"'FLCC CSI Cost Estimate Summary'!P91","v":0},null,null,"False","","","","","","","","","","",{"$f":"IF($S91=\"true\",M91,\"\")","v":""},{"$f":"IF($S91=\"true\",P91,\"\")","v":""},{"$f":"IF($S91=\"true\",P92,\"\")","v":""},{"$f":"IF($S91=\"true\",#REF!,\"\")","v":""},{"$f":"IF($S91=\"true\",#REF!,\"\")","v":""},{"$f":"IF($S91=\"true\",#REF!,\"\")","v":""},{"$f":"IF($S91=\"true\",SUM(P91:P109),\"\")","v":""}]
[{"$f":"'FLCC CSI Cost Estimate Summary'!A92:P92","v":"Contractor Scope/Trade Detail:"},null,null,null,null,null,null,null,null,null,null,null,null,null,null,null,"AEC PM Approval:",null,"False","","","","","","","","","","",null,null,null,null,null,null,{"$f":"IF($S92=\"true\",SUM(P92:P110),\"\")","v":""}]
[{"$f":"'FLCC CSI Cost Estimate Summary'!A93:B96","v":0},null,{"$f":"'FLCC CSI Cost Estimate Summary'!C93:D93","v":"Name"},null,{"$f":"'FLCC CSI Cost Estimate Summary'!E93","v":false},{"$f":"'FLCC CSI Cost Estimate Summary'!F93","v":0},{"$f":"'FLCC CSI Cost Estimate Summary'!G93:H93","v":0},null,null,{"$f":"'FLCC CSI Cost Estimate Summary'!$J93","v":0},{"$f":"C93","v":"Name"},null,{"$f":"'FLCC CSI Cost Estimate Summary'!M93:N96","v":0},null,"Base Bid",{"$f":"'FLCC CSI Cost Estimate Summary'!P93","v":0},{"$f":"IF(S93=$S$1,SUM(P93:P96),0)","v":0},null,"False","","","","","","","","","","",{"$f":"IF($S93=\"true\",M93,\"\")","v":""},{"$f":"IF($S93=\"true\",P93,\"\")","v":""},{"$f":"IF($S93=\"true\",P94,\"\")","v":""},{"$f":"IF($S93=\"true\",P95,\"\")","v":""},{"$f":"IF($S93=\"true\",P96,\"\")","v":""},{"$f":"IF($S93=\"true\",#REF!,\"\")","v":""},{"$f":"IF($S93=\"true\",SUM(P93:P96),\"\")","v":""}]
[null,null,{"$f":"'FLCC CSI Cost Estimate Summary'!C94:D94","v":"Name"},null,{"$f":"'FLCC CSI Cost Estimate Summary'!E94","v":false},{"$f":"'FLCC CSI Cost Estimate Summary'!F94","v":0},{"$f":"'FLCC CSI Cost Estimate Summary'!G94:H94","v":0},null,false,{"$f":"'FLCC CSI Cost Estimate Summary'!$J94","v":0},null,null,null,null,"Alternate",{"$f":"'FLCC CSI Cost Estimate Summary'!P94","v":0},null,null,"False","","","","","","","","","","",{"$f":"IF($S94=\"true\",M94,\"\")","v":""},{"$f":"IF($S94=\"true\",P94,\"\")","v":""},{"$f":"IF($S94=\"true\",P95,\"\")","v":""},{"$f":"IF($S94=\"true\",P96,\"\")","v":""},{"$f":"IF($S94=\"true\",P97,\"\")","v":""},{"$f":"IF($S94=\"true\",#REF!,\"\")","v":""},{"$f":"IF($S94=\"true\",SUM(P94:P97),\"\")","v":""}]
[null,null,{"$f":"'FLCC CSI Cost Estimate Summary'!C95:D95","v":"Name"},null,{"$f":"'FLCC CSI Cost Estimate Summary'!E95","v":false},{"$f":"'FLCC CSI Cost Estimate Summary'!F95","v":0},{"$f":"'FLCC CSI Cost Estimate Summary'!G95:H95","v":0},null,false,{"$f":"'FLCC CSI Cost Estimate Summary'!$J95","v":0},null,null,null,null,"Alternate",{"$f":"'FLCC CSI Cost Estimate Summary'!P95","v":0},null,null,"False","","","","","","","","","","",{"$f":"IF($S95=\"true\",M95,\"\")","v":""},{"$f":"IF($S95=\"true\",P95,\"\")","v":""},{"$f":"IF($S95=\"true\",P96,\"\")","v":""},{"$f":"IF($S95=\"true\",P97,\"\")","v":""},{"$f":"IF($S95=\"true\",#REF!,\"\")","v":""},{"$f":"IF($S95=\"true\",#REF!,\"\")","v":""},{"$f":"IF($S95=\"true\",SUM(P95:P108),\"\")","v":""}]
[null,null,{"$f":"'FLCC CSI Cost Estimate Summary'!C96:D96","v":"Name"},null,{"$f":"'FLCC CSI Cost Estimate Summary'!E96","v":false},{"$f":"'FLCC CSI Cost Estimate Summary'!F96","v":0},{"$f":"'FLCC CSI Cost Estimate Summary'!G96:H96","v":0},null,null,{"$f":"'FLCC CSI Cost Estimate Summary'!$J96","v":0},null,null,null,null,"Alternate",{"$f":"'FLCC CSI Cost Estimate Summary'!P96","v":0},null,null,"False","","","","","","","","","","",{"$f":"IF($S96=\"true\",M96,\"\")","v":""},{"$f":"IF($S96=\"true\",P96,\"\")","v":""},{"$f":"IF($S96=\"true\",P97,\"\")","v":""},{"$f":"IF($S96=\"true\",#REF!,\"\")","v":""},{"$f":"IF($S96=\"true\",#REF!,\"\")","v":""},{"$f":"IF($S96=\"true\",#REF!,\"\")","v":""},{"$f":"IF($S96=\"true\",SUM(P96:P109),\"\")","v":""}]
[{"$f":"'FLCC CSI Cost Estimate Summary'!A97:P97","v":"Contractor Scope/Trade Detail:"},null,null,null,null,null,null,null,null,null,null,null,null,null,null,null,"AEC PM Approval:",null,"False","","","","","","","","","","",null,null,null,null,null,null,{"$f":"IF($S97=\"true\",SUM(P97:P110),\"\")","v":""}]
[{"$f":"'FLCC CSI Cost Estimate Summary'!A98:B101","v":0},null,{"$f":"'FLCC CSI Cost Estimate Summary'!C98:D98","v":"Name"},null,{"$f":"'FLCC CSI Cost Estimate Summary'!E98","v":false},{"$f":"'FLCC CSI Cost Estimate Summary'!F98","v":0},{"$f":"'FLCC CSI Cost Estimate Summary'!G98:H98","v":0},null,null,{"$f":"'FLCC CSI Cost Estimate Summary'!$J98","v":0},{"$f":"C98","v":"Name"},null,{"$f":"'FLCC CSI Cost Estimate Summary'!M98:N101","v":0},null,"Base Bid",{"$f":"'FLCC CSI Cost Estimate Summary'!P98","v":0},{"$f":"IF(S98=$S$1,SUM(P98:P101),0)","v":0},null,"False","","","","","","","","","","",{"$f":"IF($S98=\"true\",M98,\"\")","v":""},{"$f":"IF($S98=\"true\",P98,\"\")","v":""},{"$f":"IF($S98=\"true\",P99,\"\")","v":""},{"$f":"IF($S98=\"true\",P100,\"\")","v":""},{"$f":"IF($S98=\"true\",P101,\"\")","v":""},{"$f":"IF($S98=\"true\",#REF!,\"\")","v":""},{"$f":"IF($S98=\"true\",SUM(P98:P101),\"\")","v":""}]
[null,null,{"$f":"'FLCC CSI Cost Estimate Summary'!C99:D99","v":"Name"},null,{"$f":"'FLCC CSI Cost Estimate Summary'!E99","v":false},{"$f":"'FLCC CSI Cost Estimate Summary'!F99","v":0},{"$f":"'FLCC CSI Cost Estimate Summary'!G99:H99","v":0},null,null,{"$f":"'FLCC CSI Cost Estimate Summary'!$J99","v":0},null,null,null,null,"Alternate",{"$f":"'FLCC CSI Cost Estimate Summary'!P99","v":0},null,null,"False","","","","","","","","","","",{"$f":"IF($S99=\"true\",M99,\"\")","v":""},{"$f":"IF($S99=\"true\",P99,\"\")","v":""},{"$f":"IF($S99=\"true\",P100,\"\")","v":""},{"$f":"IF($S99=\"true\",P101,\"\")","v":""},{"$f":"IF($S99=\"true\",P102,\"\")","v":""},{"$f":"IF($S99=\"true\",#REF!,\"\")","v":""},{"$f":"IF($S99=\"true\",SUM(P99:P102),\"\")","v":""}]
[null,null,{"$f":"'FLCC CSI Cost Estimate Summary'!C100:D100","v":"Name"},null,{"$f":"'FLCC CSI Cost Estimate Summary'!E100","v":false},{"$f":"'FLCC CSI Cost Estimate Summary'!F100","v":0},{"$f":"'FLCC CSI Cost Estimate Summary'!G100:H100","v":0},null,null,{"$f":"'FLCC CSI Cost Estimate Summary'!$J100","v":0},null,null,null,null,"Alternate",{"$f":"'FLCC CSI Cost Estimate Summary'!P100","v":0},null,null,"False","","","","","","","","","","",{"$f":"IF($S100=\"true\",M100,\"\")","v":""},{"$f":"IF($S100=\"true\",P100,\"\")","v":""},{"$f":"IF($S100=\"true\",P101,\"\")","v":""},{"$f":"IF($S100=\"true\",P102,\"\")","v":""},{"$f":"IF($S100=\"true\",#REF!,\"\")","v":""},{"$f":"IF($S100=\"true\",#REF!,\"\")","v":""},{"$f":"IF($S100=\"true\",SUM(P100:P108),\"\")","v":""}]
[null,null,{"$f":"'FLCC CSI Cost Estimate Summary'!C101:D101","v":"Name"},null,{"$f":"'FLCC CSI Cost Estimate Summary'!E101","v":false},{"$f":"'FLCC CSI Cost Estimate Summary'!F101","v":0},{"$f":"'FLCC CSI Cost Estimate Summary'!G101:H101","v":0},null,null,{"$f":"'FLCC CSI Cost Estimate Summary'!$J101","v":0},null,null,null,null,"Alternate",{"$f":"'FLCC CSI Cost Estimate Summary'!P101","v":0},null,null,"False","","","","","","","","","","",{"$f":"IF($S101=\"true\",M101,\"\")","v":""},{"$f":"IF($S101=\"true\",P101,\"\")","v":""},{"$f":"IF($S101=\"true\",P102,\"\")","v":""},{"$f":"IF($S101=\"true\",#REF!,\"\")","v":""},{"$f":"IF($S101=\"true\",#REF!,\"\")","v":""},{"$f":"IF($S101=\"true\",#REF!,\"\")","v":""},{"$f":"IF($S101=\"true\",SUM(P101:P109),\"\")","v":""}]
[{"$f":"'FLCC CSI Cost Estimate Summary'!A102:P102","v":"Contractor Scope/Trade Detail:"},null,null,null,null,null,null,null,null,null,null,null,null,null,null,null,"AEC PM Approval:",null,"False","","","","","","","","","","",null,null,null,null,null,null,{"$f":"IF($S102=\"true\",SUM(P102:P110),\"\")","v":""}]
[{"$f":"'FLCC CSI Cost Estimate Summary'!A103:B106","v":0},null,{"$f":"'FLCC CSI Cost Estimate Summary'!C103:D103","v":"Name"},null,{"$f":"'FLCC CSI Cost Estimate Summary'!E103","v":false},{"$f":"'FLCC CSI Cost Estimate Summary'!F103","v":0},{"$f":"'FLCC CSI Cost Estimate Summary'!G103:H103","v":0},null,false,{"$f":"'FLCC CSI Cost Estimate Summary'!$J103","v":false},{"$f":"C103","v":"Name"},null,{"$f":"'FLCC CSI Cost Estimate Summary'!M103:N106","v":0},null,"Base Bid",{"$f":"'FLCC CSI Cost Estimate Summary'!P103","v":0},{"$f":"IF(S103=$S$1,SUM(P103:P106),0)","v":0},null,"False","","","","","","","","","","",{"$f":"IF($S103=\"true\",M103,\"\")","v":""},{"$f":"IF($S103=\"true\",P103,\"\")","v":""},{"$f":"IF($S103=\"true\",P104,\"\")","v":""},{"$f":"IF($S103=\"true\",P105,\"\")","v":""},{"$f":"IF($S103=\"true\",P106,\"\")","v":""},{"$f":"IF($S103=\"true\",#REF!,\"\")","v":""},{"$f":"IF($S103=\"true\",SUM(P103:P106),\"\")","v":""}]
[null,null,{"$f":"'FLCC CSI Cost Estimate Summary'!C104:D104","v":"Name"},null,{"$f":"'FLCC CSI Cost Estimate Summary'!E104","v":false},{"$f":"'FLCC CSI Cost Estimate Summary'!F104","v":0},{"$f":"'FLCC CSI Cost Estimate Summary'!G104:H104","v":0},null,false,{"$f":"'FLCC CSI Cost Estimate Summary'!$J104","v":0},null,null,null,null,"Alternate",{"$f":"'FLCC CSI Cost Estimate Summary'!P104","v":0},null,null,"False","","","","","","","","","","",{"$f":"IF($S104=\"true\",M104,\"\")","v":""},{"$f":"IF($S104=\"true\",P104,\"\")","v":""},{"$f":"IF($S104=\"true\",P105,\"\")","v":""},{"$f":"IF($S104=\"true\",P106,\"\")","v":""},{"$f":"IF($S104=\"true\",P107,\"\")","v":""},{"$f":"IF($S104=\"true\",#REF!,\"\")","v":""},""]
[null,null,{"$f":"'FLCC CSI Cost Estimate Summary'!C105:D105","v":"Name"},null,{"$f":"'FLCC CSI Cost Estimate Summary'!E105","v":false},{"$f":"'FLCC CSI Cost Estimate Summary'!F105","v":0},{"$f":"'FLCC CSI Cost Estimate Summary'!G105:H105","v":0},null,false,{"$f":"'FLCC CSI Cost Estimate Summary'!$J105","v":false},null,null,null,null,"Alternate",{"$f":"'FLCC CSI Cost Estimate Summary'!P105","v":0},null,null,"False","","","","","","","","","","",{"$f":"IF($S105=\"true\",M105,\"\")","v":""},{"$f":"IF($S105=\"true\",P105,\"\")","v":""},{"$f":"IF($S105=\"true\",P106,\"\")","v":""},{"$f":"IF($S105=\"true\",P107,\"\")","v":""},{"$f":"IF($S105=\"true\",#REF!,\"\")","v":""},{"$f":"IF($S105=\"true\",#REF!,\"\")","v":""},{"$f":"IF($S105=\"true\",SUM(P105:P108),\"\")","v":""}]
[null,null,{"$f":"'FLCC CSI Cost Estimate Summary'!C106:D106","v":"Name"},null,{"$f":"'FLCC CSI Cost Estimate Summary'!E106","v":false},{"$f":"'FLCC CSI Cost Estimate Summary'!F106","v":0},{"$f":"'FLCC CSI Cost Estimate Summary'!G106:H106","v":0},null,false,{"$f":"'FLCC CSI Cost Estimate Summary'!$J106","v":0},null,null,null,null,"Alternate",{"$f":"'FLCC CSI Cost Estimate Summary'!P106","v":0},null,null,"False","","","","","","","","","","",{"$f":"IF($S106=\"true\",M106,\"\")","v":""},{"$f":"IF($S106=\"true\",P106,\"\")","v":""},{"$f":"IF($S106=\"true\",P107,\"\")","v":""},{"$f":"IF($S106=\"true\",#REF!,\"\")","v":""},{"$f":"IF($S106=\"true\",#REF!,\"\")","v":""},{"$f":"IF($S106=\"true\",#REF!,\"\")","v":""},{"$f":"IF($S106=\"true\",SUM(P106:P109),\"\")","v":""}]
[{"$f":"'FLCC CSI Cost Estimate Summary'!A107:P107","v":"Contractor Scope/Trade Detail:"},null,null,null,null,null,null,null,null,null,null,null,null,null,null,null,"AEC PM Approval:"]
[null,null,"Name",null,false,null,0,null,null,null,{"$f":"C108","v":"Name"},null,null,null,"Base Bid",0,{"$f":"SUM(P108:P111)","v":0},null,{"$f":"IF(E108,\"True\",\"False\")","v":"False"},{"$f":"IF($S108=\"true\",A108,\"\")","v":""},{"$f":"IF($S108=\"true\",C108,\"\")","v":""},{"$f":"IF($S108=\"true\",E108,\"\")","v":""},"",{"$f":"IF($S108=\"true\",F108,\"\")","v":""},"",{"$f":"IF($S108=\"true\",I108,\"\")","v":""},"",{"$f":"IF($S108=\"true\",J108,\"\")","v":""},"",{"$f":"IF($S108=\"true\",M108,\"\")","v":""},{"$f":"IF($S108=\"true\",P108,\"\")","v":""},{"$f":"IF($S108=\"true\",P109,\"\")","v":""},{"$f":"IF($S108=\"true\",P110,\"\")","v":""},{"$f":"IF($S108=\"true\",P111,\"\")","v":""},{"$f":"IF($S108=\"true\",#REF!,\"\")","v":""},{"$f":"IF($S108=\"true\",Q108,\"\")","v":""}]
[null,null,"Name",null,false,null,0,null,null,null,null,null,null,null,"Alternate",0,null,null,{"$f":"IF(E109,\"True\",\"False\")","v":"False"},{"$f":"IF($S109=\"true\",A109,\"\")","v":""},{"$f":"IF($S109=\"true\",C109,\"\")","v":""},"","","","","","","","",{"$f":"IF($S109=\"true\",M109,\"\")","v":""},{"$f":"IF($S109=\"true\",P109,\"\")","v":""},{"$f":"IF($S109=\"true\",P110,\"\")","v":""},{"$f":"IF($S109=\"true\",P111,\"\")","v":""},{"$f":"IF($S109=\"true\",P112,\"\")","v":""},{"$f":"IF($S109=\"true\",#REF!,\"\")","v":""},{"$f":"IF($S109=\"true\",Q109,\"\")","v":""}]
[null,null,"Name",null,false,null,0,null,null,null,null,null,null,null,"Alternate",0,null,null,{"$f":"IF(E110,\"True\",\"False\")","v":"False"},{"$f":"IF($S110=\"true\",A110,\"\")","v":""},{"$f":"IF($S110=\"true\",C110,\"\")","v":""},"","","","","","","","",{"$f":"IF($S110=\"true\",M110,\"\")","v":""},{"$f":"IF($S110=\"true\",P110,\"\")","v":""},{"$f":"IF($S110=\"true\",P111,\"\")","v":""},{"$f":"IF($S110=\"true\",P112,\"\")","v":""},{"$f":"IF($S110=\"true\",#REF!,\"\")","v":""},{"$f":"IF($S110=\"true\",#REF!,\"\")","v":""},{"$f":"IF($S110=\"true\",Q110,\"\")","v":""}]
[null,null,"Name",null,false,null,0,null,null,null,null,null,null,null,"Alternate",0,null,null,{"$f":"IF(E111,\"True\",\"False\")","v":"False"},{"$f":"IF($S111=\"true\",A111,\"\")","v":""},{"$f":"IF($S111=\"true\",C111,\"\")","v":""},"","","","","","","","",{"$f":"IF($S111=\"true\",M111,\"\")","v":""},{"$f":"IF($S111=\"true\",P111,\"\")","v":""},{"$f":"IF($S111=\"true\",P112,\"\")","v":""},{"$f":"IF($S111=\"true\",#REF!,\"\")","v":""},{"$f":"IF($S111=\"true\",#REF!,\"\")","v":""},{"$f":"IF($S111=\"true\",#REF!,\"\")","v":""},{"$f":"IF($S111=\"true\",Q111,\"\")","v":""}]
["Contractor Scope/Trade Detail:",null,null,null,null,null,null,null,null,null,null,null,null,null,null,null,"PM Approval:"]
[]
[null,null,null,null,null,null,null,null,null,null,null,"Trade Contractor Subtotal:",null,null,null,"Lump Sum",{"$f":"SUBTOTAL(9,Q8:R113)","v":0}]
[]
[]
[]
[]
[]
[]
[]
[]
[]
[]
[]
[]
[]
[]
[]
[]
["Full Time Laborer When Contracturally Required"]
["Scope/Trade\n(Includes CSI #'s for clarity)",null,"Proposed Trade Contractor/Self Perform",null,"Self Perform","Decline Bid or No Response","Proposed Amounts \n(low to high)",null,"No Estimates at GMP",null,"Selected Firm",null,"EMR",null,"Intended Awardee Proposal Detail  & (accepted alternates only)",null,"Total"]
[{"$f":"'FLCC CSI Cost Estimate Summary'!A133:B136","v":0},null,{"$f":"'FLCC CSI Cost Estimate Summary'!C133:D133","v":"Name"},null,"N/A",null,{"$f":"'FLCC CSI Cost Estimate Summary'!G133:H133","v":0},null,null,{"$f":"'FLCC CSI Cost Estimate Summary'!$J133","v":false},{"$f":"C133","v":"Name"},null,{"$f":"'FLCC CSI Cost Estimate Summary'!M133:N136","v":0},null,"Base Bid",{"$f":"'FLCC CSI Cost Estimate Summary'!P133","v":0},{"$f":"SUM(P133:P136)","v":0}]
[null,null,{"$f":"'FLCC CSI Cost Estimate Summary'!C134:D134","v":"Name"},null,"N/A",null,{"$f":"'FLCC CSI Cost Estimate Summary'!G134:H134","v":0},null,null,{"$f":"'FLCC CSI Cost Estimate Summary'!$J134","v":false},null,null,null,null,"Alternate",{"$f":"'FLCC CSI Cost Estimate Summary'!P134","v":0}]
[null,null,{"$f":"'FLCC CSI Cost Estimate Summary'!C135:D135","v":"Name"},null,"N/A",null,{"$f":"'FLCC CSI Cost Estimate Summary'!G135:H135","v":0},null,false,{"$f":"'FLCC CSI Cost Estimate Summary'!$J135","v":false},null,null,null,null,"Alternate",{"$f":"'FLCC CSI Cost Estimate Summary'!P135","v":0}]
[null,null,{"$f":"'FLCC CSI Cost Estimate Summary'!C136:D136","v":"Name"},null,"N/A",null,{"$f":"'FLCC CSI Cost Estimate Summary'!G136:H136","v":0},null,false,{"$f":"'FLCC CSI Cost Estimate Summary'!$J136","v":0},null,null,null,null,"Alternate",{"$f":"'FLCC CSI Cost Estimate Summary'!P136","v":0}]
[{"$f":"'FLCC CSI Cost Estimate Summary'!A137:P137","v":"Contractor Scope/Trade Detail:"},null,null,null,null,null,null,null,null,null,null,null,null,null,null,null,"PM Approval:"]
[{"$f":"'FLCC CSI Cost Estimate Summary'!A138:B141","v":0},null,{"$f":"'FLCC CSI Cost Estimate Summary'!C138:D138","v":"Name"},null,"N/A",null,{"$f":"'FLCC CSI Cost Estimate Summary'!G138:H138","v":0},null,false,{"$f":"'FLCC CSI Cost Estimate Summary'!$J138","v":false},{"$f":"C138","v":"Name"},null,{"$f":"'FLCC CSI Cost Estimate Summary'!M138:N141","v":0},null,"Base Bid",{"$f":"'FLCC CSI Cost Estimate Summary'!P138","v":0},{"$f":"SUM(P138:P141)","v":0}]
[null,null,{"$f":"'FLCC CSI Cost Estimate Summary'!C139:D139","v":"Name"},null,"N/A",null,{"$f":"'FLCC CSI Cost Estimate Summary'!G139:H139","v":0},null,false,{"$f":"'FLCC CSI Cost Estimate Summary'!$J139","v":false},null,null,null,null,"Alternate",{"$f":"'FLCC CSI Cost Estimate Summary'!P139","v":0}]
[null,null,{"$f":"'FLCC CSI Cost Estimate Summary'!C140:D140","v":"Name"},null,"N/A",null,{"$f":"'FLCC CSI Cost Estimate Summary'!G140:H140","v":0},null,false,{"$f":"'FLCC CSI Cost Estimate Summary'!$J140","v":0},null,null,null,null,"Alternate",{"$f":"'FLCC CSI Cost Estimate Summary'!P140","v":0}]
[null,null,{"$f":"'FLCC CSI Cost Estimate Summary'!C141:D141","v":"Name"},null,"N/A",null,{"$f":"'FLCC CSI Cost Estimate Summary'!G141:H141","v":0},null,false,true,null,null,null,null,"Alternate",{"$f":"'FLCC CSI Cost Estimate Summary'!P141","v":0}]
[{"$f":"'FLCC CSI Cost Estimate Summary'!A142:P142","v":"Contractor Scope/Trade Detail:"},null,null,null,null,null,null,null,null,null,null,null,null,null,null,null,"PM Approval:"]
[]
[null,null,null,null,null,null,null,null,null,null,null,"Full Time Laborer Subtotal:",null,null,null,"Lump Sum",{"$f":"SUBTOTAL(9,Q133:R142)","v":0}]
[]
["Self- Perform",null,null,null,null,null,null,null,null,null,null,"(Self Performed is not included in Trade Contractor Subtotal)"]
["Scope/Trade",null,"Trade Contractor",null,"Proposed Amount",null,null,null,null,null,null,null,null,null,null,"Proposed Amount","Total"]
[{"$f":"IFERROR(T148:T148,\"\")","v":""},null,{"$f":"IFERROR(U148,\"\")","v":""},null,{"$f":"IFERROR(Y148,\"$\")","v":"$"},null,null,null,null,null,null,null,null,null,null,{"$f":"IFERROR(AJ148,\"$\")","v":"$"},{"$f":"SUBTOTAL(9,P148:P159)","v":0},null,null,{"$f":"INDEX($T$8:$AM$112,SMALL(IF(COUNTIF($T$5,$T$8:$AM$112),MATCH(ROW($T$8:$AM$112),ROW($T$8:$AM$112)),\"\"),ROWS(V$152:$V152)),COLUMNS(V$152:$V152))","v":{"$error":"#NUM!"}},{"$f":"INDEX($T$8:$AM$112,SMALL(IF(COUNTIF($T$5,$T$8:$AM$112),MATCH(ROW($T$8:$AM$112),ROW($T$8:$AM$112)),\"\"),ROWS($V$152:W152)),COLUMNS($V$152:W152))","v":{"$error":"#NUM!"}},{"$f":"INDEX($T$8:$AM$112,SMALL(IF(COUNTIF($T$5,$T$8:$AM$112),MATCH(ROW($T$8:$AM$112),ROW($T$8:$AM$112)),\"\"),ROWS($V$152:X152)),COLUMNS($V$152:X152))","v":{"$error":"#NUM!"}},{"$f":"INDEX($T$8:$AM$112,SMALL(IF(COUNTIF($T$5,$T$8:$AM$112),MATCH(ROW($T$8:$AM$112),ROW($T$8:$AM$112)),\"\"),ROWS($V$152:Y152)),COLUMNS($V$152:Y152))","v":{"$error":"#NUM!"}},{"$f":"INDEX($T$8:$AM$112,SMALL(IF(COUNTIF($T$5,$T$8:$AM$112),MATCH(ROW($T$8:$AM$112),ROW($T$8:$AM$112)),\"\"),ROWS($V$152:Z152)),COLUMNS($V$152:Z152))","v":{"$error":"#NUM!"}},{"$f":"INDEX($T$8:$AM$112,SMALL(IF(COUNTIF($T$5,$T$8:$AM$112),MATCH(ROW($T$8:$AM$112),ROW($T$8:$AM$112)),\"\"),ROWS($V$152:AA152)),COLUMNS($V$152:AA152))","v":{"$error":"#NUM!"}},{"$f":"INDEX($T$8:$AM$112,SMALL(IF(COUNTIF($T$5,$T$8:$AM$112),MATCH(ROW($T$8:$AM$112),ROW($T$8:$AM$112)),\"\"),ROWS($V$152:AB152)),COLUMNS($V$152:AB152))","v":{"$error":"#NUM!"}},{"$f":"INDEX($T$8:$AM$112,SMALL(IF(COUNTIF($T$5,$T$8:$AM$112),MATCH(ROW($T$8:$AM$112),ROW($T$8:$AM$112)),\"\"),ROWS($V$152:AC152)),COLUMNS($V$152:AC152))","v":{"$error":"#NUM!"}},{"$f":"INDEX($T$8:$AM$112,SMALL(IF(COUNTIF($T$5,$T$8:$AM$112),MATCH(ROW($T$8:$AM$112),ROW($T$8:$AM$112)),\"\"),ROWS($V$152:AD152)),COLUMNS($V$152:AD152))","v":{"$error":"#NUM!"}},{"$f":"INDEX($T$8:$AM$112,SMALL(IF(COUNTIF($T$5,$T$8:$AM$112),MATCH(ROW($T$8:$AM$112),ROW($T$8:$AM$112)),\"\"),ROWS($V$152:AE152)),COLUMNS($V$152:AE152))","v":{"$error":"#NUM!"}},{"$f":"INDEX($T$8:$AM$112,SMALL(IF(COUNTIF($T$5,$T$8:$AM$112),MATCH(ROW($T$8:$AM$112),ROW($T$8:$AM$112)),\"\"),ROWS($V$152:AF152)),COLUMNS($V$152:AF152))","v":{"$error":"#NUM!"}},{"$f":"INDEX($T$8:$AM$112,SMALL(IF(COUNTIF($T$5,$T$8:$AM$112),MATCH(ROW($T$8:$AM$112),ROW($T$8:$AM$112)),\"\"),ROWS($V$152:AG152)),COLUMNS($V$152:AG152))","v":{"$error":"#NUM!"}},{"$f":"INDEX($T$8:$AM$112,SMALL(IF(COUNTIF($T$5,$T$8:$AM$112),MATCH(ROW($T$8:$AM$112),ROW($T$8:$AM$112)),\"\"),ROWS($V$152:AH152)),COLUMNS($V$152:AH152))","v":{"$error":"#NUM!"}},{"$f":"INDEX($T$8:$AM$112,SMALL(IF(COUNTIF($T$5,$T$8:$AM$112),MATCH(ROW($T$8:$AM$112),ROW($T$8:$AM$112)),\"\"),ROWS($V$152:AI152)),COLUMNS($V$152:AI152))","v":{"$error":"#NUM!"}},{"$f":"INDEX($T$8:$AM$112,SMALL(IF(COUNTIF($T$5,$T$8:$AM$112),MATCH(ROW($T$8:$AM$112),ROW($T$8:$AM$112)),\"\"),ROWS($V$152:AJ152)),COLUMNS($V$152:AJ152))","v":{"$error":"#NUM!"}},{"$f":"INDEX($T$8:$AM$112,SMALL(IF(COUNTIF($T$5,$T$8:$AM$112),MATCH(ROW($T$8:$AM$112),ROW($T$8:$AM$112)),\"\"),ROWS($V$152:AK152)),COLUMNS($V$152:AK152))","v":{"$error":"#NUM!"}},{"$f":"INDEX($T$8:$AM$112,SMALL(IF(COUNTIF($T$5,$T$8:$AM$112),MATCH(ROW($T$8:$AM$112),ROW($T$8:$AM$112)),\"\"),ROWS($V$152:AL152)),COLUMNS($V$152:AL152))","v":{"$error":"#NUM!"}},{"$f":"INDEX($T$8:$AM$112,SMALL(IF(COUNTIF($T$5,$T$8:$AM$112),MATCH(ROW($T$8:$AM$112),ROW($T$8:$AM$112)),\"\"),ROWS($V$152:AM152)),COLUMNS($V$152:AM152))","v":{"$error":"#NUM!"}},{"$f":"INDEX($T$8:$AM$112,SMALL(IF(COUNTIF($T$5,$T$8:$AM$112),MATCH(ROW($T$8:$AM$112),ROW($T$8:$AM$112)),\"\"),ROWS($V$152:AN152)),COLUMNS($V$152:AN152))","v":{"$error":"#NUM!"}},{"$f":"INDEX($T$8:$AM$112,SMALL(IF(COUNTIF($T$5,$T$8:$AM$112),MATCH(ROW($T$8:$AM$112),ROW($T$8:$AM$112)),\"\"),ROWS($V$152:AO152)),COLUMNS($V$152:AO152))","v":{"$error":"#NUM!"}},null,null,null,null,null,null,null,null,null,null,"*"]
["",null,"",null,"$",null,null,null,null,null,null,null,null,null,null,{"$f":"IFERROR(AJ149,\"$\")","v":"$"},null,null,null,{"$f":"INDEX($T$8:$AM$112,SMALL(IF(COUNTIF($T$5,$T$8:$AM$112),MATCH(ROW($T$8:$AM$112),ROW($T$8:$AM$112)),\"\"),ROWS(V$152:$V153)),COLUMNS(V$152:$V153))","v":{"$error":"#NUM!"}},{"$f":"INDEX($T$8:$AM$112,SMALL(IF(COUNTIF($T$5,$T$8:$AM$112),MATCH(ROW($T$8:$AM$112),ROW($T$8:$AM$112)),\"\"),ROWS($V$152:W153)),COLUMNS($V$152:W153))","v":{"$error":"#NUM!"}},{"$f":"INDEX($T$8:$AM$112,SMALL(IF(COUNTIF($T$5,$T$8:$AM$112),MATCH(ROW($T$8:$AM$112),ROW($T$8:$AM$112)),\"\"),ROWS($V$152:X153)),COLUMNS($V$152:X153))","v":{"$error":"#NUM!"}},{"$f":"INDEX($T$8:$AM$112,SMALL(IF(COUNTIF($T$5,$T$8:$AM$112),MATCH(ROW($T$8:$AM$112),ROW($T$8:$AM$112)),\"\"),ROWS($V$152:Y153)),COLUMNS($V$152:Y153))","v":{"$error":"#NUM!"}},{"$f":"INDEX($T$8:$AM$112,SMALL(IF(COUNTIF($T$5,$T$8:$AM$112),MATCH(ROW($T$8:$AM$112),ROW($T$8:$AM$112)),\"\"),ROWS($V$152:Z153)),COLUMNS($V$152:Z153))","v":{"$error":"#NUM!"}},{"$f":"INDEX($T$8:$AM$112,SMALL(IF(COUNTIF($T$5,$T$8:$AM$112),MATCH(ROW($T$8:$AM$112),ROW($T$8:$AM$112)),\"\"),ROWS($V$152:AA153)),COLUMNS($V$152:AA153))","v":{"$error":"#NUM!"}},{"$f":"INDEX($T$8:$AM$112,SMALL(IF(COUNTIF($T$5,$T$8:$AM$112),MATCH(ROW($T$8:$AM$112),ROW($T$8:$AM$112)),\"\"),ROWS($V$152:AB153)),COLUMNS($V$152:AB153))","v":{"$error":"#NUM!"}},{"$f":"INDEX($T$8:$AM$112,SMALL(IF(COUNTIF($T$5,$T$8:$AM$112),MATCH(ROW($T$8:$AM$112),ROW($T$8:$AM$112)),\"\"),ROWS($V$152:AC153)),COLUMNS($V$152:AC153))","v":{"$error":"#NUM!"}},{"$f":"INDEX($T$8:$AM$112,SMALL(IF(COUNTIF($T$5,$T$8:$AM$112),MATCH(ROW($T$8:$AM$112),ROW($T$8:$AM$112)),\"\"),ROWS($V$152:AD153)),COLUMNS($V$152:AD153))","v":{"$error":"#NUM!"}},{"$f":"INDEX($T$8:$AM$112,SMALL(IF(COUNTIF($T$5,$T$8:$AM$112),MATCH(ROW($T$8:$AM$112),ROW($T$8:$AM$112)),\"\"),ROWS($V$152:AE153)),COLUMNS($V$152:AE153))","v":{"$error":"#NUM!"}},{"$f":"INDEX($T$8:$AM$112,SMALL(IF(COUNTIF($T$5,$T$8:$AM$112),MATCH(ROW($T$8:$AM$112),ROW($T$8:$AM$112)),\"\"),ROWS($V$152:AF153)),COLUMNS($V$152:AF153))","v":{"$error":"#NUM!"}},{"$f":"INDEX($T$8:$AM$112,SMALL(IF(COUNTIF($T$5,$T$8:$AM$112),MATCH(ROW($T$8:$AM$112),ROW($T$8:$AM$112)),\"\"),ROWS($V$152:AG153)),COLUMNS($V$152:AG153))","v":{"$error":"#NUM!"}},{"$f":"INDEX($T$8:$AM$112,SMALL(IF(COUNTIF($T$5,$T$8:$AM$112),MATCH(ROW($T$8:$AM$112),ROW($T$8:$AM$112)),\"\"),ROWS($V$152:AH153)),COLUMNS($V$152:AH153))","v":{"$error":"#NUM!"}},{"$f":"INDEX($T$8:$AM$112,SMALL(IF(COUNTIF($T$5,$T$8:$AM$112),MATCH(ROW($T$8:$AM$112),ROW($T$8:$AM$112)),\"\"),ROWS($V$152:AI153)),COLUMNS($V$152:AI153))","v":{"$error":"#NUM!"}},{"$f":"INDEX($T$8:$AM$112,SMALL(IF(COUNTIF($T$5,$T$8:$AM$112),MATCH(ROW($T$8:$AM$112),ROW($T$8:$AM$112)),\"\"),ROWS($V$152:AJ153)),COLUMNS($V$152:AJ153))","v":{"$error":"#NUM!"}},{"$f":"INDEX($T$8:$AM$112,SMALL(IF(COUNTIF($T$5,$T$8:$AM$112),MATCH(ROW($T$8:$AM$112),ROW($T$8:$AM$112)),\"\"),ROWS($V$152:AK153)),COLUMNS($V$152:AK153))","v":{"$error":"#NUM!"}},{"$f":"INDEX($T$8:$AM$112,SMALL(IF(COUNTIF($T$5,$T$8:$AM$112),MATCH(ROW($T$8:$AM$112),ROW($T$8:$AM$112)),\"\"),ROWS($V$152:AL153)),COLUMNS($V$152:AL153))","v":{"$error":"#NUM!"}},{"$f":"INDEX($T$8:$AM$112,SMALL(IF(COUNTIF($T$5,$T$8:$AM$112),MATCH(ROW($T$8:$AM$112),ROW($T$8:$AM$112)),\"\"),ROWS($V$152:AM153)),COLUMNS($V$152:AM153))","v":{"$error":"#NUM!"}},{"$f":"INDEX($T$8:$AM$112,SMALL(IF(COUNTIF($T$5,$T$8:$AM$112),MATCH(ROW($T$8:$AM$112),ROW($T$8:$AM$112)),\"\"),ROWS($V$152:AN153)),COLUMNS($V$152:AN153))","v":{"$error":"#NUM!"}},{"$f":"INDEX($T$8:$AM$112,SMALL(IF(COUNTIF($T$5,$T$8:$AM$112),MATCH(ROW($T$8:$AM$112),ROW($T$8:$AM$112)),\"\"),ROWS($V$152:AO153)),COLUMNS($V$152:AO153))","v":{"$error":"#NUM!"}}]
["",null,"",null,"$",null,null,null,null,null,null,null,null,null,null,{"$f":"IFERROR(AJ150,\"$\")","v":"$"},null,null,null,{"$f":"INDEX($T$8:$AM$112,SMALL(IF(COUNTIF($T$5,$T$8:$AM$112),MATCH(ROW($T$8:$AM$112),ROW($T$8:$AM$112)),\"\"),ROWS(V$152:$V154)),COLUMNS(V$152:$V154))","v":{"$error":"#NUM!"}},{"$f":"INDEX($T$8:$AM$112,SMALL(IF(COUNTIF($T$5,$T$8:$AM$112),MATCH(ROW($T$8:$AM$112),ROW($T$8:$AM$112)),\"\"),ROWS($V$152:W154)),COLUMNS($V$152:W154))","v":{"$error":"#NUM!"}},{"$f":"INDEX($T$8:$AM$112,SMALL(IF(COUNTIF($T$5,$T$8:$AM$112),MATCH(ROW($T$8:$AM$112),ROW($T$8:$AM$112)),\"\"),ROWS($V$152:X154)),COLUMNS($V$152:X154))","v":{"$error":"#NUM!"}},{"$f":"INDEX($T$8:$AM$112,SMALL(IF(COUNTIF($T$5,$T$8:$AM$112),MATCH(ROW($T$8:$AM$112),ROW($T$8:$AM$112)),\"\"),ROWS($V$152:Y154)),COLUMNS($V$152:Y154))","v":{"$error":"#NUM!"}},{"$f":"INDEX($T$8:$AM$112,SMALL(IF(COUNTIF($T$5,$T$8:$AM$112),MATCH(ROW($T$8:$AM$112),ROW($T$8:$AM$112)),\"\"),ROWS($V$152:Z154)),COLUMNS($V$152:Z154))","v":{"$error":"#NUM!"}},{"$f":"INDEX($T$8:$AM$112,SMALL(IF(COUNTIF($T$5,$T$8:$AM$112),MATCH(ROW($T$8:$AM$112),ROW($T$8:$AM$112)),\"\"),ROWS($V$152:AA154)),COLUMNS($V$152:AA154))","v":{"$error":"#NUM!"}},{"$f":"INDEX($T$8:$AM$112,SMALL(IF(COUNTIF($T$5,$T$8:$AM$112),MATCH(ROW($T$8:$AM$112),ROW($T$8:$AM$112)),\"\"),ROWS($V$152:AB154)),COLUMNS($V$152:AB154))","v":{"$error":"#NUM!"}},{"$f":"INDEX($T$8:$AM$112,SMALL(IF(COUNTIF($T$5,$T$8:$AM$112),MATCH(ROW($T$8:$AM$112),ROW($T$8:$AM$112)),\"\"),ROWS($V$152:AC154)),COLUMNS($V$152:AC154))","v":{"$error":"#NUM!"}},{"$f":"INDEX($T$8:$AM$112,SMALL(IF(COUNTIF($T$5,$T$8:$AM$112),MATCH(ROW($T$8:$AM$112),ROW($T$8:$AM$112)),\"\"),ROWS($V$152:AD154)),COLUMNS($V$152:AD154))","v":{"$error":"#NUM!"}},{"$f":"INDEX($T$8:$AM$112,SMALL(IF(COUNTIF($T$5,$T$8:$AM$112),MATCH(ROW($T$8:$AM$112),ROW($T$8:$AM$112)),\"\"),ROWS($V$152:AE154)),COLUMNS($V$152:AE154))","v":{"$error":"#NUM!"}},{"$f":"INDEX($T$8:$AM$112,SMALL(IF(COUNTIF($T$5,$T$8:$AM$112),MATCH(ROW($T$8:$AM$112),ROW($T$8:$AM$112)),\"\"),ROWS($V$152:AF154)),COLUMNS($V$152:AF154))","v":{"$error":"#NUM!"}},{"$f":"INDEX($T$8:$AM$112,SMALL(IF(COUNTIF($T$5,$T$8:$AM$112),MATCH(ROW($T$8:$AM$112),ROW($T$8:$AM$112)),\"\"),ROWS($V$152:AG154)),COLUMNS($V$152:AG154))","v":{"$error":"#NUM!"}},{"$f":"INDEX($T$8:$AM$112,SMALL(IF(COUNTIF($T$5,$T$8:$AM$112),MATCH(ROW($T$8:$AM$112),ROW($T$8:$AM$112)),\"\"),ROWS($V$152:AH154)),COLUMNS($V$152:AH154))","v":{"$error":"#NUM!"}},{"$f":"INDEX($T$8:$AM$112,SMALL(IF(COUNTIF($T$5,$T$8:$AM$112),MATCH(ROW($T$8:$AM$112),ROW($T$8:$AM$112)),\"\"),ROWS($V$152:AI154)),COLUMNS($V$152:AI154))","v":{"$error":"#NUM!"}},{"$f":"INDEX($T$8:$AM$112,SMALL(IF(COUNTIF($T$5,$T$8:$AM$112),MATCH(ROW($T$8:$AM$112),ROW($T$8:$AM$112)),\"\"),ROWS($V$152:AJ154)),COLUMNS($V$152:AJ154))","v":{"$error":"#NUM!"}},{"$f":"INDEX($T$8:$AM$112,SMALL(IF(COUNTIF($T$5,$T$8:$AM$112),MATCH(ROW($T$8:$AM$112),ROW($T$8:$AM$112)),\"\"),ROWS($V$152:AK154)),COLUMNS($V$152:AK154))","v":{"$error":"#NUM!"}},{"$f":"INDEX($T$8:$AM$112,SMALL(IF(COUNTIF($T$5,$T$8:$AM$112),MATCH(ROW($T$8:$AM$112),ROW($T$8:$AM$112)),\"\"),ROWS($V$152:AL154)),COLUMNS($V$152:AL154))","v":{"$error":"#NUM!"}},{"$f":"INDEX($T$8:$AM$112,SMALL(IF(COUNTIF($T$5,$T$8:$AM$112),MATCH(ROW($T$8:$AM$112),ROW($T$8:$AM$112)),\"\"),ROWS($V$152:AM154)),COLUMNS($V$152:AM154))","v":{"$error":"#NUM!"}},{"$f":"INDEX($T$8:$AM$112,SMALL(IF(COUNTIF($T$5,$T$8:$AM$112),MATCH(ROW($T$8:$AM$112),ROW($T$8:$AM$112)),\"\"),ROWS($V$152:AN154)),COLUMNS($V$152:AN154))","v":{"$error":"#NUM!"}},{"$f":"INDEX($T$8:$AM$112,SMALL(IF(COUNTIF($T$5,$T$8:$AM$112),MATCH(ROW($T$8:$AM$112),ROW($T$8:$AM$112)),\"\"),ROWS($V$152:AO154)),COLUMNS($V$152:AO154))","v":{"$error":"#NUM!"}}]
["",null,"",null,"$",null,null,null,null,null,null,null,null,null,null,"$",null,null,null,{"$f":"INDEX($T$8:$AM$112,SMALL(IF(COUNTIF($T$5,$T$8:$AM$112),MATCH(ROW($T$8:$AM$112),ROW($T$8:$AM$112)),\"\"),ROWS(V$152:$V155)),COLUMNS(V$152:$V155))","v":{"$error":"#NUM!"}},{"$f":"INDEX($T$8:$AM$112,SMALL(IF(COUNTIF($T$5,$T$8:$AM$112),MATCH(ROW($T$8:$AM$112),ROW($T$8:$AM$112)),\"\"),ROWS($V$152:W155)),COLUMNS($V$152:W155))","v":{"$error":"#NUM!"}},{"$f":"INDEX($T$8:$AM$112,SMALL(IF(COUNTIF($T$5,$T$8:$AM$112),MATCH(ROW($T$8:$AM$112),ROW($T$8:$AM$112)),\"\"),ROWS($V$152:X155)),COLUMNS($V$152:X155))","v":{"$error":"#NUM!"}},{"$f":"INDEX($T$8:$AM$112,SMALL(IF(COUNTIF($T$5,$T$8:$AM$112),MATCH(ROW($T$8:$AM$112),ROW($T$8:$AM$112)),\"\"),ROWS($V$152:Y155)),COLUMNS($V$152:Y155))","v":{"$error":"#NUM!"}},{"$f":"INDEX($T$8:$AM$112,SMALL(IF(COUNTIF($T$5,$T$8:$AM$112),MATCH(ROW($T$8:$AM$112),ROW($T$8:$AM$112)),\"\"),ROWS($V$152:Z155)),COLUMNS($V$152:Z155))","v":{"$error":"#NUM!"}},{"$f":"INDEX($T$8:$AM$112,SMALL(IF(COUNTIF($T$5,$T$8:$AM$112),MATCH(ROW($T$8:$AM$112),ROW($T$8:$AM$112)),\"\"),ROWS($V$152:AA155)),COLUMNS($V$152:AA155))","v":{"$error":"#NUM!"}},{"$f":"INDEX($T$8:$AM$112,SMALL(IF(COUNTIF($T$5,$T$8:$AM$112),MATCH(ROW($T$8:$AM$112),ROW($T$8:$AM$112)),\"\"),ROWS($V$152:AB155)),COLUMNS($V$152:AB155))","v":{"$error":"#NUM!"}},{"$f":"INDEX($T$8:$AM$112,SMALL(IF(COUNTIF($T$5,$T$8:$AM$112),MATCH(ROW($T$8:$AM$112),ROW($T$8:$AM$112)),\"\"),ROWS($V$152:AC155)),COLUMNS($V$152:AC155))","v":{"$error":"#NUM!"}},{"$f":"INDEX($T$8:$AM$112,SMALL(IF(COUNTIF($T$5,$T$8:$AM$112),MATCH(ROW($T$8:$AM$112),ROW($T$8:$AM$112)),\"\"),ROWS($V$152:AD155)),COLUMNS($V$152:AD155))","v":{"$error":"#NUM!"}},{"$f":"INDEX($T$8:$AM$112,SMALL(IF(COUNTIF($T$5,$T$8:$AM$112),MATCH(ROW($T$8:$AM$112),ROW($T$8:$AM$112)),\"\"),ROWS($V$152:AE155)),COLUMNS($V$152:AE155))","v":{"$error":"#NUM!"}},{"$f":"INDEX($T$8:$AM$112,SMALL(IF(COUNTIF($T$5,$T$8:$AM$112),MATCH(ROW($T$8:$AM$112),ROW($T$8:$AM$112)),\"\"),ROWS($V$152:AF155)),COLUMNS($V$152:AF155))","v":{"$error":"#NUM!"}},{"$f":"INDEX($T$8:$AM$112,SMALL(IF(COUNTIF($T$5,$T$8:$AM$112),MATCH(ROW($T$8:$AM$112),ROW($T$8:$AM$112)),\"\"),ROWS($V$152:AG155)),COLUMNS($V$152:AG155))","v":{"$error":"#NUM!"}},{"$f":"INDEX($T$8:$AM$112,SMALL(IF(COUNTIF($T$5,$T$8:$AM$112),MATCH(ROW($T$8:$AM$112),ROW($T$8:$AM$112)),\"\"),ROWS($V$152:AH155)),COLUMNS($V$152:AH155))","v":{"$error":"#NUM!"}},{"$f":"INDEX($T$8:$AM$112,SMALL(IF(COUNTIF($T$5,$T$8:$AM$112),MATCH(ROW($T$8:$AM$112),ROW($T$8:$AM$112)),\"\"),ROWS($V$152:AI155)),COLUMNS($V$152:AI155))","v":{"$error":"#NUM!"}},{"$f":"INDEX($T$8:$AM$112,SMALL(IF(COUNTIF($T$5,$T$8:$AM$112),MATCH(ROW($T$8:$AM$112),ROW($T$8:$AM$112)),\"\"),ROWS($V$152:AJ155)),COLUMNS($V$152:AJ155))","v":{"$error":"#NUM!"}},{"$f":"INDEX($T$8:$AM$112,SMALL(IF(COUNTIF($T$5,$T$8:$AM$112),MATCH(ROW($T$8:$AM$112),ROW($T$8:$AM$112)),\"\"),ROWS($V$152:AK155)),COLUMNS($V$152:AK155))","v":{"$error":"#NUM!"}},{"$f":"INDEX($T$8:$AM$112,SMALL(IF(COUNTIF($T$5,$T$8:$AM$112),MATCH(ROW($T$8:$AM$112),ROW($T$8:$AM$112)),\"\"),ROWS($V$152:AL155)),COLUMNS($V$152:AL155))","v":{"$error":"#NUM!"}},{"$f":"INDEX($T$8:$AM$112,SMALL(IF(COUNTIF($T$5,$T$8:$AM$112),MATCH(ROW($T$8:$AM$112),ROW($T$8:$AM$112)),\"\"),ROWS($V$152:AM155)),COLUMNS($V$152:AM155))","v":{"$error":"#NUM!"}},{"$f":"INDEX($T$8:$AM$112,SMALL(IF(COUNTIF($T$5,$T$8:$AM$112),MATCH(ROW($T$8:$AM$112),ROW($T$8:$AM$112)),\"\"),ROWS($V$152:AN155)),COLUMNS($V$152:AN155))","v":{"$error":"#NUM!"}},{"$f":"INDEX($T$8:$AM$112,SMALL(IF(COUNTIF($T$5,$T$8:$AM$112),MATCH(ROW($T$8:$AM$112),ROW($T$8:$AM$112)),\"\"),ROWS($V$152:AO155)),COLUMNS($V$152:AO155))","v":{"$error":"#NUM!"}}]
["",null,"",null,"$",null,null,null,null,null,null,null,null,null,null,"$",null,null,null,{"$f":"INDEX($T$8:$AM$112,SMALL(IF(COUNTIF($T$5,$T$8:$AM$112),MATCH(ROW($T$8:$AM$112),ROW($T$8:$AM$112)),\"\"),ROWS(V$152:$V156)),COLUMNS(V$152:$V156))","v":{"$error":"#NUM!"}},{"$f":"INDEX($T$8:$AM$112,SMALL(IF(COUNTIF($T$5,$T$8:$AM$112),MATCH(ROW($T$8:$AM$112),ROW($T$8:$AM$112)),\"\"),ROWS($V$152:W156)),COLUMNS($V$152:W156))","v":{"$error":"#NUM!"}},{"$f":"INDEX($T$8:$AM$112,SMALL(IF(COUNTIF($T$5,$T$8:$AM$112),MATCH(ROW($T$8:$AM$112),ROW($T$8:$AM$112)),\"\"),ROWS($V$152:X156)),COLUMNS($V$152:X156))","v":{"$error":"#NUM!"}},{"$f":"INDEX($T$8:$AM$112,SMALL(IF(COUNTIF($T$5,$T$8:$AM$112),MATCH(ROW($T$8:$AM$112),ROW($T$8:$AM$112)),\"\"),ROWS($V$152:Y156)),COLUMNS($V$152:Y156))","v":{"$error":"#NUM!"}},{"$f":"INDEX($T$8:$AM$112,SMALL(IF(COUNTIF($T$5,$T$8:$AM$112),MATCH(ROW($T$8:$AM$112),ROW($T$8:$AM$112)),\"\"),ROWS($V$152:Z156)),COLUMNS($V$152:Z156))","v":{"$error":"#NUM!"}},{"$f":"INDEX($T$8:$AM$112,SMALL(IF(COUNTIF($T$5,$T$8:$AM$112),MATCH(ROW($T$8:$AM$112),ROW($T$8:$AM$112)),\"\"),ROWS($V$152:AA156)),COLUMNS($V$152:AA156))","v":{"$error":"#NUM!"}},{"$f":"INDEX($T$8:$AM$112,SMALL(IF(COUNTIF($T$5,$T$8:$AM$112),MATCH(ROW($T$8:$AM$112),ROW($T$8:$AM$112)),\"\"),ROWS($V$152:AB156)),COLUMNS($V$152:AB156))","v":{"$error":"#NUM!"}},{"$f":"INDEX($T$8:$AM$112,SMALL(IF(COUNTIF($T$5,$T$8:$AM$112),MATCH(ROW($T$8:$AM$112),ROW($T$8:$AM$112)),\"\"),ROWS($V$152:AC156)),COLUMNS($V$152:AC156))","v":{"$error":"#NUM!"}},{"$f":"INDEX($T$8:$AM$112,SMALL(IF(COUNTIF($T$5,$T$8:$AM$112),MATCH(ROW($T$8:$AM$112),ROW($T$8:$AM$112)),\"\"),ROWS($V$152:AD156)),COLUMNS($V$152:AD156))","v":{"$error":"#NUM!"}},{"$f":"INDEX($T$8:$AM$112,SMALL(IF(COUNTIF($T$5,$T$8:$AM$112),MATCH(ROW($T$8:$AM$112),ROW($T$8:$AM$112)),\"\"),ROWS($V$152:AE156)),COLUMNS($V$152:AE156))","v":{"$error":"#NUM!"}},{"$f":"INDEX($T$8:$AM$112,SMALL(IF(COUNTIF($T$5,$T$8:$AM$112),MATCH(ROW($T$8:$AM$112),ROW($T$8:$AM$112)),\"\"),ROWS($V$152:AF156)),COLUMNS($V$152:AF156))","v":{"$error":"#NUM!"}},{"$f":"INDEX($T$8:$AM$112,SMALL(IF(COUNTIF($T$5,$T$8:$AM$112),MATCH(ROW($T$8:$AM$112),ROW($T$8:$AM$112)),\"\"),ROWS($V$152:AG156)),COLUMNS($V$152:AG156))","v":{"$error":"#NUM!"}},{"$f":"INDEX($T$8:$AM$112,SMALL(IF(COUNTIF($T$5,$T$8:$AM$112),MATCH(ROW($T$8:$AM$112),ROW($T$8:$AM$112)),\"\"),ROWS($V$152:AH156)),COLUMNS($V$152:AH156))","v":{"$error":"#NUM!"}},{"$f":"INDEX($T$8:$AM$112,SMALL(IF(COUNTIF($T$5,$T$8:$AM$112),MATCH(ROW($T$8:$AM$112),ROW($T$8:$AM$112)),\"\"),ROWS($V$152:AI156)),COLUMNS($V$152:AI156))","v":{"$error":"#NUM!"}},{"$f":"INDEX($T$8:$AM$112,SMALL(IF(COUNTIF($T$5,$T$8:$AM$112),MATCH(ROW($T$8:$AM$112),ROW($T$8:$AM$112)),\"\"),ROWS($V$152:AJ156)),COLUMNS($V$152:AJ156))","v":{"$error":"#NUM!"}},{"$f":"INDEX($T$8:$AM$112,SMALL(IF(COUNTIF($T$5,$T$8:$AM$112),MATCH(ROW($T$8:$AM$112),ROW($T$8:$AM$112)),\"\"),ROWS($V$152:AK156)),COLUMNS($V$152:AK156))","v":{"$error":"#NUM!"}},{"$f":"INDEX($T$8:$AM$112,SMALL(IF(COUNTIF($T$5,$T$8:$AM$112),MATCH(ROW($T$8:$AM$112),ROW($T$8:$AM$112)),\"\"),ROWS($V$152:AL156)),COLUMNS($V$152:AL156))","v":{"$error":"#NUM!"}},{"$f":"INDEX($T$8:$AM$112,SMALL(IF(COUNTIF($T$5,$T$8:$AM$112),MATCH(ROW($T$8:$AM$112),ROW($T$8:$AM$112)),\"\"),ROWS($V$152:AM156)),COLUMNS($V$152:AM156))","v":{"$error":"#NUM!"}},{"$f":"INDEX($T$8:$AM$112,SMALL(IF(COUNTIF($T$5,$T$8:$AM$112),MATCH(ROW($T$8:$AM$112),ROW($T$8:$AM$112)),\"\"),ROWS($V$152:AN156)),COLUMNS($V$152:AN156))","v":{"$error":"#NUM!"}},{"$f":"INDEX($T$8:$AM$112,SMALL(IF(COUNTIF($T$5,$T$8:$AM$112),MATCH(ROW($T$8:$AM$112),ROW($T$8:$AM$112)),\"\"),ROWS($V$152:AO156)),COLUMNS($V$152:AO156))","v":{"$error":"#NUM!"}}]
["",null,"",null,"$",null,null,null,null,null,null,null,null,null,null,"$",null,null,null,{"$f":"INDEX($T$8:$AM$112,SMALL(IF(COUNTIF($T$5,$T$8:$AM$112),MATCH(ROW($T$8:$AM$112),ROW($T$8:$AM$112)),\"\"),ROWS(V$152:$V157)),COLUMNS(V$152:$V157))","v":{"$error":"#NUM!"}},{"$f":"INDEX($T$8:$AM$112,SMALL(IF(COUNTIF($T$5,$T$8:$AM$112),MATCH(ROW($T$8:$AM$112),ROW($T$8:$AM$112)),\"\"),ROWS($V$152:W157)),COLUMNS($V$152:W157))","v":{"$error":"#NUM!"}},{"$f":"INDEX($T$8:$AM$112,SMALL(IF(COUNTIF($T$5,$T$8:$AM$112),MATCH(ROW($T$8:$AM$112),ROW($T$8:$AM$112)),\"\"),ROWS($V$152:X157)),COLUMNS($V$152:X157))","v":{"$error":"#NUM!"}},{"$f":"INDEX($T$8:$AM$112,SMALL(IF(COUNTIF($T$5,$T$8:$AM$112),MATCH(ROW($T$8:$AM$112),ROW($T$8:$AM$112)),\"\"),ROWS($V$152:Y157)),COLUMNS($V$152:Y157))","v":{"$error":"#NUM!"}},{"$f":"INDEX($T$8:$AM$112,SMALL(IF(COUNTIF($T$5,$T$8:$AM$112),MATCH(ROW($T$8:$AM$112),ROW($T$8:$AM$112)),\"\"),ROWS($V$152:Z157)),COLUMNS($V$152:Z157))","v":{"$error":"#NUM!"}},{"$f":"INDEX($T$8:$AM$112,SMALL(IF(COUNTIF($T$5,$T$8:$AM$112),MATCH(ROW($T$8:$AM$112),ROW($T$8:$AM$112)),\"\"),ROWS($V$152:AA157)),COLUMNS($V$152:AA157))","v":{"$error":"#NUM!"}},{"$f":"INDEX($T$8:$AM$112,SMALL(IF(COUNTIF($T$5,$T$8:$AM$112),MATCH(ROW($T$8:$AM$112),ROW($T$8:$AM$112)),\"\"),ROWS($V$152:AB157)),COLUMNS($V$152:AB157))","v":{"$error":"#NUM!"}},{"$f":"INDEX($T$8:$AM$112,SMALL(IF(COUNTIF($T$5,$T$8:$AM$112),MATCH(ROW($T$8:$AM$112),ROW($T$8:$AM$112)),\"\"),ROWS($V$152:AC157)),COLUMNS($V$152:AC157))","v":{"$error":"#NUM!"}},{"$f":"INDEX($T$8:$AM$112,SMALL(IF(COUNTIF($T$5,$T$8:$AM$112),MATCH(ROW($T$8:$AM$112),ROW($T$8:$AM$112)),\"\"),ROWS($V$152:AD157)),COLUMNS($V$152:AD157))","v":{"$error":"#NUM!"}},{"$f":"INDEX($T$8:$AM$112,SMALL(IF(COUNTIF($T$5,$T$8:$AM$112),MATCH(ROW($T$8:$AM$112),ROW($T$8:$AM$112)),\"\"),ROWS($V$152:AE157)),COLUMNS($V$152:AE157))","v":{"$error":"#NUM!"}},{"$f":"INDEX($T$8:$AM$112,SMALL(IF(COUNTIF($T$5,$T$8:$AM$112),MATCH(ROW($T$8:$AM$112),ROW($T$8:$AM$112)),\"\"),ROWS($V$152:AF157)),COLUMNS($V$152:AF157))","v":{"$error":"#NUM!"}},{"$f":"INDEX($T$8:$AM$112,SMALL(IF(COUNTIF($T$5,$T$8:$AM$112),MATCH(ROW($T$8:$AM$112),ROW($T$8:$AM$112)),\"\"),ROWS($V$152:AG157)),COLUMNS($V$152:AG157))","v":{"$error":"#NUM!"}},{"$f":"INDEX($T$8:$AM$112,SMALL(IF(COUNTIF($T$5,$T$8:$AM$112),MATCH(ROW($T$8:$AM$112),ROW($T$8:$AM$112)),\"\"),ROWS($V$152:AH157)),COLUMNS($V$152:AH157))","v":{"$error":"#NUM!"}},{"$f":"INDEX($T$8:$AM$112,SMALL(IF(COUNTIF($T$5,$T$8:$AM$112),MATCH(ROW($T$8:$AM$112),ROW($T$8:$AM$112)),\"\"),ROWS($V$152:AI157)),COLUMNS($V$152:AI157))","v":{"$error":"#NUM!"}},{"$f":"INDEX($T$8:$AM$112,SMALL(IF(COUNTIF($T$5,$T$8:$AM$112),MATCH(ROW($T$8:$AM$112),ROW($T$8:$AM$112)),\"\"),ROWS($V$152:AJ157)),COLUMNS($V$152:AJ157))","v":{"$error":"#NUM!"}},{"$f":"INDEX($T$8:$AM$112,SMALL(IF(COUNTIF($T$5,$T$8:$AM$112),MATCH(ROW($T$8:$AM$112),ROW($T$8:$AM$112)),\"\"),ROWS($V$152:AK157)),COLUMNS($V$152:AK157))","v":{"$error":"#NUM!"}},{"$f":"INDEX($T$8:$AM$112,SMALL(IF(COUNTIF($T$5,$T$8:$AM$112),MATCH(ROW($T$8:$AM$112),ROW($T$8:$AM$112)),\"\"),ROWS($V$152:AL157)),COLUMNS($V$152:AL157))","v":{"$error":"#NUM!"}},{"$f":"INDEX($T$8:$AM$112,SMALL(IF(COUNTIF($T$5,$T$8:$AM$112),MATCH(ROW($T$8:$AM$112),ROW($T$8:$AM$112)),\"\"),ROWS($V$152:AM157)),COLUMNS($V$152:AM157))","v":{"$error":"#NUM!"}},{"$f":"INDEX($T$8:$AM$112,SMALL(IF(COUNTIF($T$5,$T$8:$AM$112),MATCH(ROW($T$8:$AM$112),ROW($T$8:$AM$112)),\"\"),ROWS($V$152:AN157)),COLUMNS($V$152:AN157))","v":{"$error":"#NUM!"}},{"$f":"INDEX($T$8:$AM$112,SMALL(IF(COUNTIF($T$5,$T$8:$AM$112),MATCH(ROW($T$8:$AM$112),ROW($T$8:$AM$112)),\"\"),ROWS($V$152:AO157)),COLUMNS($V$152:AO157))","v":{"$error":"#NUM!"}}]
["",null,"",null,"$",null,null,null,null,null,null,null,null,null,null,"$",null,null,null,{"$f":"INDEX($T$8:$AM$112,SMALL(IF(COUNTIF($T$5,$T$8:$AM$112),MATCH(ROW($T$8:$AM$112),ROW($T$8:$AM$112)),\"\"),ROWS(V$152:$V158)),COLUMNS(V$152:$V158))","v":{"$error":"#NUM!"}},{"$f":"INDEX($T$8:$AM$112,SMALL(IF(COUNTIF($T$5,$T$8:$AM$112),MATCH(ROW($T$8:$AM$112),ROW($T$8:$AM$112)),\"\"),ROWS($V$152:W158)),COLUMNS($V$152:W158))","v":{"$error":"#NUM!"}},{"$f":"INDEX($T$8:$AM$112,SMALL(IF(COUNTIF($T$5,$T$8:$AM$112),MATCH(ROW($T$8:$AM$112),ROW($T$8:$AM$112)),\"\"),ROWS($V$152:X158)),COLUMNS($V$152:X158))","v":{"$error":"#NUM!"}},{"$f":"INDEX($T$8:$AM$112,SMALL(IF(COUNTIF($T$5,$T$8:$AM$112),MATCH(ROW($T$8:$AM$112),ROW($T$8:$AM$112)),\"\"),ROWS($V$152:Y158)),COLUMNS($V$152:Y158))","v":{"$error":"#NUM!"}},{"$f":"INDEX($T$8:$AM$112,SMALL(IF(COUNTIF($T$5,$T$8:$AM$112),MATCH(ROW($T$8:$AM$112),ROW($T$8:$AM$112)),\"\"),ROWS($V$152:Z158)),COLUMNS($V$152:Z158))","v":{"$error":"#NUM!"}},{"$f":"INDEX($T$8:$AM$112,SMALL(IF(COUNTIF($T$5,$T$8:$AM$112),MATCH(ROW($T$8:$AM$112),ROW($T$8:$AM$112)),\"\"),ROWS($V$152:AA158)),COLUMNS($V$152:AA158))","v":{"$error":"#NUM!"}},{"$f":"INDEX($T$8:$AM$112,SMALL(IF(COUNTIF($T$5,$T$8:$AM$112),MATCH(ROW($T$8:$AM$112),ROW($T$8:$AM$112)),\"\"),ROWS($V$152:AB158)),COLUMNS($V$152:AB158))","v":{"$error":"#NUM!"}},{"$f":"INDEX($T$8:$AM$112,SMALL(IF(COUNTIF($T$5,$T$8:$AM$112),MATCH(ROW($T$8:$AM$112),ROW($T$8:$AM$112)),\"\"),ROWS($V$152:AC158)),COLUMNS($V$152:AC158))","v":{"$error":"#NUM!"}},{"$f":"INDEX($T$8:$AM$112,SMALL(IF(COUNTIF($T$5,$T$8:$AM$112),MATCH(ROW($T$8:$AM$112),ROW($T$8:$AM$112)),\"\"),ROWS($V$152:AD158)),COLUMNS($V$152:AD158))","v":{"$error":"#NUM!"}},{"$f":"INDEX($T$8:$AM$112,SMALL(IF(COUNTIF($T$5,$T$8:$AM$112),MATCH(ROW($T$8:$AM$112),ROW($T$8:$AM$112)),\"\"),ROWS($V$152:AE158)),COLUMNS($V$152:AE158))","v":{"$error":"#NUM!"}},{"$f":"INDEX($T$8:$AM$112,SMALL(IF(COUNTIF($T$5,$T$8:$AM$112),MATCH(ROW($T$8:$AM$112),ROW($T$8:$AM$112)),\"\"),ROWS($V$152:AF158)),COLUMNS($V$152:AF158))","v":{"$error":"#NUM!"}},{"$f":"INDEX($T$8:$AM$112,SMALL(IF(COUNTIF($T$5,$T$8:$AM$112),MATCH(ROW($T$8:$AM$112),ROW($T$8:$AM$112)),\"\"),ROWS($V$152:AG158)),COLUMNS($V$152:AG158))","v":{"$error":"#NUM!"}},{"$f":"INDEX($T$8:$AM$112,SMALL(IF(COUNTIF($T$5,$T$8:$AM$112),MATCH(ROW($T$8:$AM$112),ROW($T$8:$AM$112)),\"\"),ROWS($V$152:AH158)),COLUMNS($V$152:AH158))","v":{"$error":"#NUM!"}},{"$f":"INDEX($T$8:$AM$112,SMALL(IF(COUNTIF($T$5,$T$8:$AM$112),MATCH(ROW($T$8:$AM$112),ROW($T$8:$AM$112)),\"\"),ROWS($V$152:AI158)),COLUMNS($V$152:AI158))","v":{"$error":"#NUM!"}},{"$f":"INDEX($T$8:$AM$112,SMALL(IF(COUNTIF($T$5,$T$8:$AM$112),MATCH(ROW($T$8:$AM$112),ROW($T$8:$AM$112)),\"\"),ROWS($V$152:AJ158)),COLUMNS($V$152:AJ158))","v":{"$error":"#NUM!"}},{"$f":"INDEX($T$8:$AM$112,SMALL(IF(COUNTIF($T$5,$T$8:$AM$112),MATCH(ROW($T$8:$AM$112),ROW($T$8:$AM$112)),\"\"),ROWS($V$152:AK158)),COLUMNS($V$152:AK158))","v":{"$error":"#NUM!"}},{"$f":"INDEX($T$8:$AM$112,SMALL(IF(COUNTIF($T$5,$T$8:$AM$112),MATCH(ROW($T$8:$AM$112),ROW($T$8:$AM$112)),\"\"),ROWS($V$152:AL158)),COLUMNS($V$152:AL158))","v":{"$error":"#NUM!"}},{"$f":"INDEX($T$8:$AM$112,SMALL(IF(COUNTIF($T$5,$T$8:$AM$112),MATCH(ROW($T$8:$AM$112),ROW($T$8:$AM$112)),\"\"),ROWS($V$152:AM158)),COLUMNS($V$152:AM158))","v":{"$error":"#NUM!"}},{"$f":"INDEX($T$8:$AM$112,SMALL(IF(COUNTIF($T$5,$T$8:$AM$112),MATCH(ROW($T$8:$AM$112),ROW($T$8:$AM$112)),\"\"),ROWS($V$152:AN158)),COLUMNS($V$152:AN158))","v":{"$error":"#NUM!"}},{"$f":"INDEX($T$8:$AM$112,SMALL(IF(COUNTIF($T$5,$T$8:$AM$112),MATCH(ROW($T$8:$AM$112),ROW($T$8:$AM$112)),\"\"),ROWS($V$152:AO158)),COLUMNS($V$152:AO158))","v":{"$error":"#NUM!"}}]
["",null,"",null,"$",null,null,null,null,null,null,null,null,null,null,"$",null,null,null,{"$f":"INDEX($T$8:$AM$112,SMALL(IF(COUNTIF($T$5,$T$8:$AM$112),MATCH(ROW($T$8:$AM$112),ROW($T$8:$AM$112)),\"\"),ROWS(V$152:$V159)),COLUMNS(V$152:$V159))","v":{"$error":"#NUM!"}},{"$f":"INDEX($T$8:$AM$112,SMALL(IF(COUNTIF($T$5,$T$8:$AM$112),MATCH(ROW($T$8:$AM$112),ROW($T$8:$AM$112)),\"\"),ROWS($V$152:W159)),COLUMNS($V$152:W159))","v":{"$error":"#NUM!"}},{"$f":"INDEX($T$8:$AM$112,SMALL(IF(COUNTIF($T$5,$T$8:$AM$112),MATCH(ROW($T$8:$AM$112),ROW($T$8:$AM$112)),\"\"),ROWS($V$152:X159)),COLUMNS($V$152:X159))","v":{"$error":"#NUM!"}},{"$f":"INDEX($T$8:$AM$112,SMALL(IF(COUNTIF($T$5,$T$8:$AM$112),MATCH(ROW($T$8:$AM$112),ROW($T$8:$AM$112)),\"\"),ROWS($V$152:Y159)),COLUMNS($V$152:Y159))","v":{"$error":"#NUM!"}},{"$f":"INDEX($T$8:$AM$112,SMALL(IF(COUNTIF($T$5,$T$8:$AM$112),MATCH(ROW($T$8:$AM$112),ROW($T$8:$AM$112)),\"\"),ROWS($V$152:Z159)),COLUMNS($V$152:Z159))","v":{"$error":"#NUM!"}},{"$f":"INDEX($T$8:$AM$112,SMALL(IF(COUNTIF($T$5,$T$8:$AM$112),MATCH(ROW($T$8:$AM$112),ROW($T$8:$AM$112)),\"\"),ROWS($V$152:AA159)),COLUMNS($V$152:AA159))","v":{"$error":"#NUM!"}},{"$f":"INDEX($T$8:$AM$112,SMALL(IF(COUNTIF($T$5,$T$8:$AM$112),MATCH(ROW($T$8:$AM$112),ROW($T$8:$AM$112)),\"\"),ROWS($V$152:AB159)),COLUMNS($V$152:AB159))","v":{"$error":"#NUM!"}},{"$f":"INDEX($T$8:$AM$112,SMALL(IF(COUNTIF($T$5,$T$8:$AM$112),MATCH(ROW($T$8:$AM$112),ROW($T$8:$AM$112)),\"\"),ROWS($V$152:AC159)),COLUMNS($V$152:AC159))","v":{"$error":"#NUM!"}},{"$f":"INDEX($T$8:$AM$112,SMALL(IF(COUNTIF($T$5,$T$8:$AM$112),MATCH(ROW($T$8:$AM$112),ROW($T$8:$AM$112)),\"\"),ROWS($V$152:AD159)),COLUMNS($V$152:AD159))","v":{"$error":"#NUM!"}},{"$f":"INDEX($T$8:$AM$112,SMALL(IF(COUNTIF($T$5,$T$8:$AM$112),MATCH(ROW($T$8:$AM$112),ROW($T$8:$AM$112)),\"\"),ROWS($V$152:AE159)),COLUMNS($V$152:AE159))","v":{"$error":"#NUM!"}},{"$f":"INDEX($T$8:$AM$112,SMALL(IF(COUNTIF($T$5,$T$8:$AM$112),MATCH(ROW($T$8:$AM$112),ROW($T$8:$AM$112)),\"\"),ROWS($V$152:AF159)),COLUMNS($V$152:AF159))","v":{"$error":"#NUM!"}},{"$f":"INDEX($T$8:$AM$112,SMALL(IF(COUNTIF($T$5,$T$8:$AM$112),MATCH(ROW($T$8:$AM$112),ROW($T$8:$AM$112)),\"\"),ROWS($V$152:AG159)),COLUMNS($V$152:AG159))","v":{"$error":"#NUM!"}},{"$f":"INDEX($T$8:$AM$112,SMALL(IF(COUNTIF($T$5,$T$8:$AM$112),MATCH(ROW($T$8:$AM$112),ROW($T$8:$AM$112)),\"\"),ROWS($V$152:AH159)),COLUMNS($V$152:AH159))","v":{"$error":"#NUM!"}},{"$f":"INDEX($T$8:$AM$112,SMALL(IF(COUNTIF($T$5,$T$8:$AM$112),MATCH(ROW($T$8:$AM$112),ROW($T$8:$AM$112)),\"\"),ROWS($V$152:AI159)),COLUMNS($V$152:AI159))","v":{"$error":"#NUM!"}},{"$f":"INDEX($T$8:$AM$112,SMALL(IF(COUNTIF($T$5,$T$8:$AM$112),MATCH(ROW($T$8:$AM$112),ROW($T$8:$AM$112)),\"\"),ROWS($V$152:AJ159)),COLUMNS($V$152:AJ159))","v":{"$error":"#NUM!"}},{"$f":"INDEX($T$8:$AM$112,SMALL(IF(COUNTIF($T$5,$T$8:$AM$112),MATCH(ROW($T$8:$AM$112),ROW($T$8:$AM$112)),\"\"),ROWS($V$152:AK159)),COLUMNS($V$152:AK159))","v":{"$error":"#NUM!"}},{"$f":"INDEX($T$8:$AM$112,SMALL(IF(COUNTIF($T$5,$T$8:$AM$112),MATCH(ROW($T$8:$AM$112),ROW($T$8:$AM$112)),\"\"),ROWS($V$152:AL159)),COLUMNS($V$152:AL159))","v":{"$error":"#NUM!"}},{"$f":"INDEX($T$8:$AM$112,SMALL(IF(COUNTIF($T$5,$T$8:$AM$112),MATCH(ROW($T$8:$AM$112),ROW($T$8:$AM$112)),\"\"),ROWS($V$152:AM159)),COLUMNS($V$152:AM159))","v":{"$error":"#NUM!"}},{"$f":"INDEX($T$8:$AM$112,SMALL(IF(COUNTIF($T$5,$T$8:$AM$112),MATCH(ROW($T$8:$AM$112),ROW($T$8:$AM$112)),\"\"),ROWS($V$152:AN159)),COLUMNS($V$152:AN159))","v":{"$error":"#NUM!"}},{"$f":"INDEX($T$8:$AM$112,SMALL(IF(COUNTIF($T$5,$T$8:$AM$112),MATCH(ROW($T$8:$AM$112),ROW($T$8:$AM$112)),\"\"),ROWS($V$152:AO159)),COLUMNS($V$152:AO159))","v":{"$error":"#NUM!"}}]
["",null,"",null,"$",null,null,null,null,null,null,null,null,null,null,"$",null,null,null,{"$f":"INDEX($T$8:$AM$112,SMALL(IF(COUNTIF($T$5,$T$8:$AM$112),MATCH(ROW($T$8:$AM$112),ROW($T$8:$AM$112)),\"\"),ROWS(V$152:$V160)),COLUMNS(V$152:$V160))","v":{"$error":"#NUM!"}},{"$f":"INDEX($T$8:$AM$112,SMALL(IF(COUNTIF($T$5,$T$8:$AM$112),MATCH(ROW($T$8:$AM$112),ROW($T$8:$AM$112)),\"\"),ROWS($V$152:W160)),COLUMNS($V$152:W160))","v":{"$error":"#NUM!"}},{"$f":"INDEX($T$8:$AM$112,SMALL(IF(COUNTIF($T$5,$T$8:$AM$112),MATCH(ROW($T$8:$AM$112),ROW($T$8:$AM$112)),\"\"),ROWS($V$152:X160)),COLUMNS($V$152:X160))","v":{"$error":"#NUM!"}},{"$f":"INDEX($T$8:$AM$112,SMALL(IF(COUNTIF($T$5,$T$8:$AM$112),MATCH(ROW($T$8:$AM$112),ROW($T$8:$AM$112)),\"\"),ROWS($V$152:Y160)),COLUMNS($V$152:Y160))","v":{"$error":"#NUM!"}},{"$f":"INDEX($T$8:$AM$112,SMALL(IF(COUNTIF($T$5,$T$8:$AM$112),MATCH(ROW($T$8:$AM$112),ROW($T$8:$AM$112)),\"\"),ROWS($V$152:Z160)),COLUMNS($V$152:Z160))","v":{"$error":"#NUM!"}},{"$f":"INDEX($T$8:$AM$112,SMALL(IF(COUNTIF($T$5,$T$8:$AM$112),MATCH(ROW($T$8:$AM$112),ROW($T$8:$AM$112)),\"\"),ROWS($V$152:AA160)),COLUMNS($V$152:AA160))","v":{"$error":"#NUM!"}},{"$f":"INDEX($T$8:$AM$112,SMALL(IF(COUNTIF($T$5,$T$8:$AM$112),MATCH(ROW($T$8:$AM$112),ROW($T$8:$AM$112)),\"\"),ROWS($V$152:AB160)),COLUMNS($V$152:AB160))","v":{"$error":"#NUM!"}},{"$f":"INDEX($T$8:$AM$112,SMALL(IF(COUNTIF($T$5,$T$8:$AM$112),MATCH(ROW($T$8:$AM$112),ROW($T$8:$AM$112)),\"\"),ROWS($V$152:AC160)),COLUMNS($V$152:AC160))","v":{"$error":"#NUM!"}},{"$f":"INDEX($T$8:$AM$112,SMALL(IF(COUNTIF($T$5,$T$8:$AM$112),MATCH(ROW($T$8:$AM$112),ROW($T$8:$AM$112)),\"\"),ROWS($V$152:AD160)),COLUMNS($V$152:AD160))","v":{"$error":"#NUM!"}},{"$f":"INDEX($T$8:$AM$112,SMALL(IF(COUNTIF($T$5,$T$8:$AM$112),MATCH(ROW($T$8:$AM$112),ROW($T$8:$AM$112)),\"\"),ROWS($V$152:AE160)),COLUMNS($V$152:AE160))","v":{"$error":"#NUM!"}},{"$f":"INDEX($T$8:$AM$112,SMALL(IF(COUNTIF($T$5,$T$8:$AM$112),MATCH(ROW($T$8:$AM$112),ROW($T$8:$AM$112)),\"\"),ROWS($V$152:AF160)),COLUMNS($V$152:AF160))","v":{"$error":"#NUM!"}},{"$f":"INDEX($T$8:$AM$112,SMALL(IF(COUNTIF($T$5,$T$8:$AM$112),MATCH(ROW($T$8:$AM$112),ROW($T$8:$AM$112)),\"\"),ROWS($V$152:AG160)),COLUMNS($V$152:AG160))","v":{"$error":"#NUM!"}},{"$f":"INDEX($T$8:$AM$112,SMALL(IF(COUNTIF($T$5,$T$8:$AM$112),MATCH(ROW($T$8:$AM$112),ROW($T$8:$AM$112)),\"\"),ROWS($V$152:AH160)),COLUMNS($V$152:AH160))","v":{"$error":"#NUM!"}},{"$f":"INDEX($T$8:$AM$112,SMALL(IF(COUNTIF($T$5,$T$8:$AM$112),MATCH(ROW($T$8:$AM$112),ROW($T$8:$AM$112)),\"\"),ROWS($V$152:AI160)),COLUMNS($V$152:AI160))","v":{"$error":"#NUM!"}},{"$f":"INDEX($T$8:$AM$112,SMALL(IF(COUNTIF($T$5,$T$8:$AM$112),MATCH(ROW($T$8:$AM$112),ROW($T$8:$AM$112)),\"\"),ROWS($V$152:AJ160)),COLUMNS($V$152:AJ160))","v":{"$error":"#NUM!"}},{"$f":"INDEX($T$8:$AM$112,SMALL(IF(COUNTIF($T$5,$T$8:$AM$112),MATCH(ROW($T$8:$AM$112),ROW($T$8:$AM$112)),\"\"),ROWS($V$152:AK160)),COLUMNS($V$152:AK160))","v":{"$error":"#NUM!"}},{"$f":"INDEX($T$8:$AM$112,SMALL(IF(COUNTIF($T$5,$T$8:$AM$112),MATCH(ROW($T$8:$AM$112),ROW($T$8:$AM$112)),\"\"),ROWS($V$152:AL160)),COLUMNS($V$152:AL160))","v":{"$error":"#NUM!"}},{"$f":"INDEX($T$8:$AM$112,SMALL(IF(COUNTIF($T$5,$T$8:$AM$112),MATCH(ROW($T$8:$AM$112),ROW($T$8:$AM$112)),\"\"),ROWS($V$152:AM160)),COLUMNS($V$152:AM160))","v":{"$error":"#NUM!"}},{"$f":"INDEX($T$8:$AM$112,SMALL(IF(COUNTIF($T$5,$T$8:$AM$112),MATCH(ROW($T$8:$AM$112),ROW($T$8:$AM$112)),\"\"),ROWS($V$152:AN160)),COLUMNS($V$152:AN160))","v":{"$error":"#NUM!"}},{"$f":"INDEX($T$8:$AM$112,SMALL(IF(COUNTIF($T$5,$T$8:$AM$112),MATCH(ROW($T$8:$AM$112),ROW($T$8:$AM$112)),\"\"),ROWS($V$152:AO160)),COLUMNS($V$152:AO160))","v":{"$error":"#NUM!"}}]
["",null,"",null,"$",null,null,null,null,null,null,null,null,null,null,"$",null,null,null,{"$f":"INDEX($T$8:$AM$112,SMALL(IF(COUNTIF($T$5,$T$8:$AM$112),MATCH(ROW($T$8:$AM$112),ROW($T$8:$AM$112)),\"\"),ROWS(V$152:$V161)),COLUMNS(V$152:$V161))","v":{"$error":"#NUM!"}},{"$f":"INDEX($T$8:$AM$112,SMALL(IF(COUNTIF($T$5,$T$8:$AM$112),MATCH(ROW($T$8:$AM$112),ROW($T$8:$AM$112)),\"\"),ROWS($V$152:W161)),COLUMNS($V$152:W161))","v":{"$error":"#NUM!"}},{"$f":"INDEX($T$8:$AM$112,SMALL(IF(COUNTIF($T$5,$T$8:$AM$112),MATCH(ROW($T$8:$AM$112),ROW($T$8:$AM$112)),\"\"),ROWS($V$152:X161)),COLUMNS($V$152:X161))","v":{"$error":"#NUM!"}},{"$f":"INDEX($T$8:$AM$112,SMALL(IF(COUNTIF($T$5,$T$8:$AM$112),MATCH(ROW($T$8:$AM$112),ROW($T$8:$AM$112)),\"\"),ROWS($V$152:Y161)),COLUMNS($V$152:Y161))","v":{"$error":"#NUM!"}},{"$f":"INDEX($T$8:$AM$112,SMALL(IF(COUNTIF($T$5,$T$8:$AM$112),MATCH(ROW($T$8:$AM$112),ROW($T$8:$AM$112)),\"\"),ROWS($V$152:Z161)),COLUMNS($V$152:Z161))","v":{"$error":"#NUM!"}},{"$f":"INDEX($T$8:$AM$112,SMALL(IF(COUNTIF($T$5,$T$8:$AM$112),MATCH(ROW($T$8:$AM$112),ROW($T$8:$AM$112)),\"\"),ROWS($V$152:AA161)),COLUMNS($V$152:AA161))","v":{"$error":"#NUM!"}},{"$f":"INDEX($T$8:$AM$112,SMALL(IF(COUNTIF($T$5,$T$8:$AM$112),MATCH(ROW($T$8:$AM$112),ROW($T$8:$AM$112)),\"\"),ROWS($V$152:AB161)),COLUMNS($V$152:AB161))","v":{"$error":"#NUM!"}},{"$f":"INDEX($T$8:$AM$112,SMALL(IF(COUNTIF($T$5,$T$8:$AM$112),MATCH(ROW($T$8:$AM$112),ROW($T$8:$AM$112)),\"\"),ROWS($V$152:AC161)),COLUMNS($V$152:AC161))","v":{"$error":"#NUM!"}},{"$f":"INDEX($T$8:$AM$112,SMALL(IF(COUNTIF($T$5,$T$8:$AM$112),MATCH(ROW($T$8:$AM$112),ROW($T$8:$AM$112)),\"\"),ROWS($V$152:AD161)),COLUMNS($V$152:AD161))","v":{"$error":"#NUM!"}},{"$f":"INDEX($T$8:$AM$112,SMALL(IF(COUNTIF($T$5,$T$8:$AM$112),MATCH(ROW($T$8:$AM$112),ROW($T$8:$AM$112)),\"\"),ROWS($V$152:AE161)),COLUMNS($V$152:AE161))","v":{"$error":"#NUM!"}},{"$f":"INDEX($T$8:$AM$112,SMALL(IF(COUNTIF($T$5,$T$8:$AM$112),MATCH(ROW($T$8:$AM$112),ROW($T$8:$AM$112)),\"\"),ROWS($V$152:AF161)),COLUMNS($V$152:AF161))","v":{"$error":"#NUM!"}},{"$f":"INDEX($T$8:$AM$112,SMALL(IF(COUNTIF($T$5,$T$8:$AM$112),MATCH(ROW($T$8:$AM$112),ROW($T$8:$AM$112)),\"\"),ROWS($V$152:AG161)),COLUMNS($V$152:AG161))","v":{"$error":"#NUM!"}},{"$f":"INDEX($T$8:$AM$112,SMALL(IF(COUNTIF($T$5,$T$8:$AM$112),MATCH(ROW($T$8:$AM$112),ROW($T$8:$AM$112)),\"\"),ROWS($V$152:AH161)),COLUMNS($V$152:AH161))","v":{"$error":"#NUM!"}},{"$f":"INDEX($T$8:$AM$112,SMALL(IF(COUNTIF($T$5,$T$8:$AM$112),MATCH(ROW($T$8:$AM$112),ROW($T$8:$AM$112)),\"\"),ROWS($V$152:AI161)),COLUMNS($V$152:AI161))","v":{"$error":"#NUM!"}},{"$f":"INDEX($T$8:$AM$112,SMALL(IF(COUNTIF($T$5,$T$8:$AM$112),MATCH(ROW($T$8:$AM$112),ROW($T$8:$AM$112)),\"\"),ROWS($V$152:AJ161)),COLUMNS($V$152:AJ161))","v":{"$error":"#NUM!"}},{"$f":"INDEX($T$8:$AM$112,SMALL(IF(COUNTIF($T$5,$T$8:$AM$112),MATCH(ROW($T$8:$AM$112),ROW($T$8:$AM$112)),\"\"),ROWS($V$152:AK161)),COLUMNS($V$152:AK161))","v":{"$error":"#NUM!"}},{"$f":"INDEX($T$8:$AM$112,SMALL(IF(COUNTIF($T$5,$T$8:$AM$112),MATCH(ROW($T$8:$AM$112),ROW($T$8:$AM$112)),\"\"),ROWS($V$152:AL161)),COLUMNS($V$152:AL161))","v":{"$error":"#NUM!"}},{"$f":"INDEX($T$8:$AM$112,SMALL(IF(COUNTIF($T$5,$T$8:$AM$112),MATCH(ROW($T$8:$AM$112),ROW($T$8:$AM$112)),\"\"),ROWS($V$152:AM161)),COLUMNS($V$152:AM161))","v":{"$error":"#NUM!"}},{"$f":"INDEX($T$8:$AM$112,SMALL(IF(COUNTIF($T$5,$T$8:$AM$112),MATCH(ROW($T$8:$AM$112),ROW($T$8:$AM$112)),\"\"),ROWS($V$152:AN161)),COLUMNS($V$152:AN161))","v":{"$error":"#NUM!"}},{"$f":"INDEX($T$8:$AM$112,SMALL(IF(COUNTIF($T$5,$T$8:$AM$112),MATCH(ROW($T$8:$AM$112),ROW($T$8:$AM$112)),\"\"),ROWS($V$152:AO161)),COLUMNS($V$152:AO161))","v":{"$error":"#NUM!"}}]
["",null,"",null,"$",null,null,null,null,null,null,null,null,null,null,"$",null,null,null,{"$f":"INDEX($T$8:$AM$112,SMALL(IF(COUNTIF($T$5,$T$8:$AM$112),MATCH(ROW($T$8:$AM$112),ROW($T$8:$AM$112)),\"\"),ROWS(V$152:$V162)),COLUMNS(V$152:$V162))","v":{"$error":"#NUM!"}},{"$f":"INDEX($T$8:$AM$112,SMALL(IF(COUNTIF($T$5,$T$8:$AM$112),MATCH(ROW($T$8:$AM$112),ROW($T$8:$AM$112)),\"\"),ROWS($V$152:W162)),COLUMNS($V$152:W162))","v":{"$error":"#NUM!"}},{"$f":"INDEX($T$8:$AM$112,SMALL(IF(COUNTIF($T$5,$T$8:$AM$112),MATCH(ROW($T$8:$AM$112),ROW($T$8:$AM$112)),\"\"),ROWS($V$152:X162)),COLUMNS($V$152:X162))","v":{"$error":"#NUM!"}},{"$f":"INDEX($T$8:$AM$112,SMALL(IF(COUNTIF($T$5,$T$8:$AM$112),MATCH(ROW($T$8:$AM$112),ROW($T$8:$AM$112)),\"\"),ROWS($V$152:Y162)),COLUMNS($V$152:Y162))","v":{"$error":"#NUM!"}},{"$f":"INDEX($T$8:$AM$112,SMALL(IF(COUNTIF($T$5,$T$8:$AM$112),MATCH(ROW($T$8:$AM$112),ROW($T$8:$AM$112)),\"\"),ROWS($V$152:Z162)),COLUMNS($V$152:Z162))","v":{"$error":"#NUM!"}},{"$f":"INDEX($T$8:$AM$112,SMALL(IF(COUNTIF($T$5,$T$8:$AM$112),MATCH(ROW($T$8:$AM$112),ROW($T$8:$AM$112)),\"\"),ROWS($V$152:AA162)),COLUMNS($V$152:AA162))","v":{"$error":"#NUM!"}},{"$f":"INDEX($T$8:$AM$112,SMALL(IF(COUNTIF($T$5,$T$8:$AM$112),MATCH(ROW($T$8:$AM$112),ROW($T$8:$AM$112)),\"\"),ROWS($V$152:AB162)),COLUMNS($V$152:AB162))","v":{"$error":"#NUM!"}},{"$f":"INDEX($T$8:$AM$112,SMALL(IF(COUNTIF($T$5,$T$8:$AM$112),MATCH(ROW($T$8:$AM$112),ROW($T$8:$AM$112)),\"\"),ROWS($V$152:AC162)),COLUMNS($V$152:AC162))","v":{"$error":"#NUM!"}},{"$f":"INDEX($T$8:$AM$112,SMALL(IF(COUNTIF($T$5,$T$8:$AM$112),MATCH(ROW($T$8:$AM$112),ROW($T$8:$AM$112)),\"\"),ROWS($V$152:AD162)),COLUMNS($V$152:AD162))","v":{"$error":"#NUM!"}},{"$f":"INDEX($T$8:$AM$112,SMALL(IF(COUNTIF($T$5,$T$8:$AM$112),MATCH(ROW($T$8:$AM$112),ROW($T$8:$AM$112)),\"\"),ROWS($V$152:AE162)),COLUMNS($V$152:AE162))","v":{"$error":"#NUM!"}},{"$f":"INDEX($T$8:$AM$112,SMALL(IF(COUNTIF($T$5,$T$8:$AM$112),MATCH(ROW($T$8:$AM$112),ROW($T$8:$AM$112)),\"\"),ROWS($V$152:AF162)),COLUMNS($V$152:AF162))","v":{"$error":"#NUM!"}},{"$f":"INDEX($T$8:$AM$112,SMALL(IF(COUNTIF($T$5,$T$8:$AM$112),MATCH(ROW($T$8:$AM$112),ROW($T$8:$AM$112)),\"\"),ROWS($V$152:AG162)),COLUMNS($V$152:AG162))","v":{"$error":"#NUM!"}},{"$f":"INDEX($T$8:$AM$112,SMALL(IF(COUNTIF($T$5,$T$8:$AM$112),MATCH(ROW($T$8:$AM$112),ROW($T$8:$AM$112)),\"\"),ROWS($V$152:AH162)),COLUMNS($V$152:AH162))","v":{"$error":"#NUM!"}},{"$f":"INDEX($T$8:$AM$112,SMALL(IF(COUNTIF($T$5,$T$8:$AM$112),MATCH(ROW($T$8:$AM$112),ROW($T$8:$AM$112)),\"\"),ROWS($V$152:AI162)),COLUMNS($V$152:AI162))","v":{"$error":"#NUM!"}},{"$f":"INDEX($T$8:$AM$112,SMALL(IF(COUNTIF($T$5,$T$8:$AM$112),MATCH(ROW($T$8:$AM$112),ROW($T$8:$AM$112)),\"\"),ROWS($V$152:AJ162)),COLUMNS($V$152:AJ162))","v":{"$error":"#NUM!"}},{"$f":"INDEX($T$8:$AM$112,SMALL(IF(COUNTIF($T$5,$T$8:$AM$112),MATCH(ROW($T$8:$AM$112),ROW($T$8:$AM$112)),\"\"),ROWS($V$152:AK162)),COLUMNS($V$152:AK162))","v":{"$error":"#NUM!"}},{"$f":"INDEX($T$8:$AM$112,SMALL(IF(COUNTIF($T$5,$T$8:$AM$112),MATCH(ROW($T$8:$AM$112),ROW($T$8:$AM$112)),\"\"),ROWS($V$152:AL162)),COLUMNS($V$152:AL162))","v":{"$error":"#NUM!"}},{"$f":"INDEX($T$8:$AM$112,SMALL(IF(COUNTIF($T$5,$T$8:$AM$112),MATCH(ROW($T$8:$AM$112),ROW($T$8:$AM$112)),\"\"),ROWS($V$152:AM162)),COLUMNS($V$152:AM162))","v":{"$error":"#NUM!"}},{"$f":"INDEX($T$8:$AM$112,SMALL(IF(COUNTIF($T$5,$T$8:$AM$112),MATCH(ROW($T$8:$AM$112),ROW($T$8:$AM$112)),\"\"),ROWS($V$152:AN162)),COLUMNS($V$152:AN162))","v":{"$error":"#NUM!"}},{"$f":"INDEX($T$8:$AM$112,SMALL(IF(COUNTIF($T$5,$T$8:$AM$112),MATCH(ROW($T$8:$AM$112),ROW($T$8:$AM$112)),\"\"),ROWS($V$152:AO162)),COLUMNS($V$152:AO162))","v":{"$error":"#NUM!"}}]
["",null,"",null,"$",null,null,null,null,null,null,null,null,null,null,"$",null,null,null,{"$f":"INDEX($T$8:$AM$112,SMALL(IF(COUNTIF($T$5,$T$8:$AM$112),MATCH(ROW($T$8:$AM$112),ROW($T$8:$AM$112)),\"\"),ROWS(V$152:$V163)),COLUMNS(V$152:$V163))","v":{"$error":"#NUM!"}},{"$f":"INDEX($T$8:$AM$112,SMALL(IF(COUNTIF($T$5,$T$8:$AM$112),MATCH(ROW($T$8:$AM$112),ROW($T$8:$AM$112)),\"\"),ROWS($V$152:W163)),COLUMNS($V$152:W163))","v":{"$error":"#NUM!"}},{"$f":"INDEX($T$8:$AM$112,SMALL(IF(COUNTIF($T$5,$T$8:$AM$112),MATCH(ROW($T$8:$AM$112),ROW($T$8:$AM$112)),\"\"),ROWS($V$152:X163)),COLUMNS($V$152:X163))","v":{"$error":"#NUM!"}},{"$f":"INDEX($T$8:$AM$112,SMALL(IF(COUNTIF($T$5,$T$8:$AM$112),MATCH(ROW($T$8:$AM$112),ROW($T$8:$AM$112)),\"\"),ROWS($V$152:Y163)),COLUMNS($V$152:Y163))","v":{"$error":"#NUM!"}},{"$f":"INDEX($T$8:$AM$112,SMALL(IF(COUNTIF($T$5,$T$8:$AM$112),MATCH(ROW($T$8:$AM$112),ROW($T$8:$AM$112)),\"\"),ROWS($V$152:Z163)),COLUMNS($V$152:Z163))","v":{"$error":"#NUM!"}},{"$f":"INDEX($T$8:$AM$112,SMALL(IF(COUNTIF($T$5,$T$8:$AM$112),MATCH(ROW($T$8:$AM$112),ROW($T$8:$AM$112)),\"\"),ROWS($V$152:AA163)),COLUMNS($V$152:AA163))","v":{"$error":"#NUM!"}},{"$f":"INDEX($T$8:$AM$112,SMALL(IF(COUNTIF($T$5,$T$8:$AM$112),MATCH(ROW($T$8:$AM$112),ROW($T$8:$AM$112)),\"\"),ROWS($V$152:AB163)),COLUMNS($V$152:AB163))","v":{"$error":"#NUM!"}},{"$f":"INDEX($T$8:$AM$112,SMALL(IF(COUNTIF($T$5,$T$8:$AM$112),MATCH(ROW($T$8:$AM$112),ROW($T$8:$AM$112)),\"\"),ROWS($V$152:AC163)),COLUMNS($V$152:AC163))","v":{"$error":"#NUM!"}},{"$f":"INDEX($T$8:$AM$112,SMALL(IF(COUNTIF($T$5,$T$8:$AM$112),MATCH(ROW($T$8:$AM$112),ROW($T$8:$AM$112)),\"\"),ROWS($V$152:AD163)),COLUMNS($V$152:AD163))","v":{"$error":"#NUM!"}},{"$f":"INDEX($T$8:$AM$112,SMALL(IF(COUNTIF($T$5,$T$8:$AM$112),MATCH(ROW($T$8:$AM$112),ROW($T$8:$AM$112)),\"\"),ROWS($V$152:AE163)),COLUMNS($V$152:AE163))","v":{"$error":"#NUM!"}},{"$f":"INDEX($T$8:$AM$112,SMALL(IF(COUNTIF($T$5,$T$8:$AM$112),MATCH(ROW($T$8:$AM$112),ROW($T$8:$AM$112)),\"\"),ROWS($V$152:AF163)),COLUMNS($V$152:AF163))","v":{"$error":"#NUM!"}},{"$f":"INDEX($T$8:$AM$112,SMALL(IF(COUNTIF($T$5,$T$8:$AM$112),MATCH(ROW($T$8:$AM$112),ROW($T$8:$AM$112)),\"\"),ROWS($V$152:AG163)),COLUMNS($V$152:AG163))","v":{"$error":"#NUM!"}},{"$f":"INDEX($T$8:$AM$112,SMALL(IF(COUNTIF($T$5,$T$8:$AM$112),MATCH(ROW($T$8:$AM$112),ROW($T$8:$AM$112)),\"\"),ROWS($V$152:AH163)),COLUMNS($V$152:AH163))","v":{"$error":"#NUM!"}},{"$f":"INDEX($T$8:$AM$112,SMALL(IF(COUNTIF($T$5,$T$8:$AM$112),MATCH(ROW($T$8:$AM$112),ROW($T$8:$AM$112)),\"\"),ROWS($V$152:AI163)),COLUMNS($V$152:AI163))","v":{"$error":"#NUM!"}},{"$f":"INDEX($T$8:$AM$112,SMALL(IF(COUNTIF($T$5,$T$8:$AM$112),MATCH(ROW($T$8:$AM$112),ROW($T$8:$AM$112)),\"\"),ROWS($V$152:AJ163)),COLUMNS($V$152:AJ163))","v":{"$error":"#NUM!"}},{"$f":"INDEX($T$8:$AM$112,SMALL(IF(COUNTIF($T$5,$T$8:$AM$112),MATCH(ROW($T$8:$AM$112),ROW($T$8:$AM$112)),\"\"),ROWS($V$152:AK163)),COLUMNS($V$152:AK163))","v":{"$error":"#NUM!"}},{"$f":"INDEX($T$8:$AM$112,SMALL(IF(COUNTIF($T$5,$T$8:$AM$112),MATCH(ROW($T$8:$AM$112),ROW($T$8:$AM$112)),\"\"),ROWS($V$152:AL163)),COLUMNS($V$152:AL163))","v":{"$error":"#NUM!"}},{"$f":"INDEX($T$8:$AM$112,SMALL(IF(COUNTIF($T$5,$T$8:$AM$112),MATCH(ROW($T$8:$AM$112),ROW($T$8:$AM$112)),\"\"),ROWS($V$152:AM163)),COLUMNS($V$152:AM163))","v":{"$error":"#NUM!"}},{"$f":"INDEX($T$8:$AM$112,SMALL(IF(COUNTIF($T$5,$T$8:$AM$112),MATCH(ROW($T$8:$AM$112),ROW($T$8:$AM$112)),\"\"),ROWS($V$152:AN163)),COLUMNS($V$152:AN163))","v":{"$error":"#NUM!"}},{"$f":"INDEX($T$8:$AM$112,SMALL(IF(COUNTIF($T$5,$T$8:$AM$112),MATCH(ROW($T$8:$AM$112),ROW($T$8:$AM$112)),\"\"),ROWS($V$152:AO163)),COLUMNS($V$152:AO163))","v":{"$error":"#NUM!"}}]
["Self- Perform Subtotal (Must not Exceed 20% of Total Amount)",null,null,null,null,null,null,null,null,null,null,"Percent of Total:",{"$f":"IFERROR(Q160/(Q160+Q114),\"\")","v":""},null,null,"Lump Sum",{"$f":"Q148","v":0},null,null,null,null,null,null,null,null,null,null,null,null,null,null,null,null,null,null,null,null,null,null,null,null,null,null,null,null,null,null,null,null,null,"Add sep total for Laborer"]
[null,null,null,null,null,null,null,null,null,null,null,null,null,null,null,null,null,null,null,null,null,null,null,null,null,null,null,null,null,null,null,null,null,null,null,null,null,null,null,null,null,null,null,null,null,null,null,null,null,null,"Same for GMP"]
[null,null,null,null,null,null,null,null,null,null,null,null,null,null,null,"Total Amount",{"$f":"Q160+Q114+Q144","v":0}]
[null,null,null,null,null,null,null,null,null,null,null,null,null,null,null,null,null,null,null,null,{"$f":"IF(OR($M$160=\"\",$M$160<0.2),FALSE,TRUE)","v":false}]
["Detail the Reason Self-Performed Total Exceeds 20%"]
[{"$f":"'FLCC CSI Cost Estimate Summary'!A165:T170","v":0}]
[]
[]
[]
[]
[]
["C.2. CM General Conditions"]
[]
["Description",null,null,null,null,null,null,null,null,null,null,null,null,null,null,null,"Amount"]
[null,null,null,null,null,null,null,null,null,null,null,null,null,null,null,null,null,null,null,null,null,null,null,null,null,null,null,null,null,null,null,null,null,null,null,null,null,null,null,null,null,null,null,null,null,null,null,null,null,"*"]
[{"$f":"'FLCC CSI Cost Estimate Summary'!A175:P175","v":"Temp Protection"},null,null,null,null,null,null,null,null,null,null,null,null,null,null,null,{"$f":"'FLCC CSI Cost Estimate Summary'!Q175:R175","v":0}]
[{"$f":"'FLCC CSI Cost Estimate Summary'!A176:P176","v":"Dumpsters"},null,null,null,null,null,null,null,null,null,null,null,null,null,null,null,{"$f":"'FLCC CSI Cost Estimate Summary'!Q176:R176","v":0}]
[{"$f":"'FLCC CSI Cost Estimate Summary'!A177:P177","v":"Safety"},null,null,null,null,null,null,null,null,null,null,null,null,null,null,null,{"$f":"'FLCC CSI Cost Estimate Summary'!Q177:R177","v":0}]
[{"$f":"'FLCC CSI Cost Estimate Summary'!A178:P178","v":"Signage"},null,null,null,null,null,null,null,null,null,null,null,null,null,null,null,{"$f":"'FLCC CSI Cost Estimate Summary'!Q178:R178","v":0}]
[{"$f":"'FLCC CSI Cost Estimate Summary'!A179:P179","v":"IT Consumables"},null,null,null,null,null,null,null,null,null,null,null,null,null,null,null,{"$f":"'FLCC CSI Cost Estimate Summary'!Q179:R179","v":0}]
[{"$f":"'FLCC CSI Cost Estimate Summary'!A180:P180","v":"Progress/Final cleaning"},null,null,null,null,null,null,null,null,null,null,null,null,null,null,null,{"$f":"'FLCC CSI Cost Estimate Summary'!Q180:R180","v":0}]
[{"$f":"'FLCC CSI Cost Estimate Summary'!A181:P181","v":0},null,null,null,null,null,null,null,null,null,null,null,null,null,null,null,{"$f":"'FLCC CSI Cost Estimate Summary'!Q181:R181","v":0}]
[{"$f":"'FLCC CSI Cost Estimate Summary'!A182:P182","v":0},null,null,null,null,null,null,null,null,null,null,null,null,null,null,null,{"$f":"'FLCC CSI Cost Estimate Summary'!Q182:R182","v":0}]
[{"$f":"'FLCC CSI Cost Estimate Summary'!A183:P183","v":0},null,null,null,null,null,null,null,null,null,null,null,null,null,null,null,{"$f":"'FLCC CSI Cost Estimate Summary'!Q183:R183","v":0}]
[{"$f":"'FLCC CSI Cost Estimate Summary'!A184:P184","v":0},null,null,null,null,null,null,null,null,null,null,null,null,null,null,null,{"$f":"'FLCC CSI Cost Estimate Summary'!Q184:R184","v":0}]
[{"$f":"'FLCC CSI Cost Estimate Summary'!A185:P185","v":0},null,null,null,null,null,null,null,null,null,null,null,null,null,null,null,{"$f":"'FLCC CSI Cost Estimate Summary'!Q185:R185","v":0}]
[{"$f":"'FLCC CSI Cost Estimate Summary'!A186:P186","v":0},null,null,null,null,null,null,null,null,null,null,null,null,null,null,null,{"$f":"'FLCC CSI Cost Estimate Summary'!Q186:R186","v":0}]
[]
["Subtotal of General Conditions",null,null,null,null,null,null,null,null,null,null,null,null,null,null,null,{"$f":"SUBTOTAL(9,Q175:R187)","v":0}]
[]
[]
[]
[]
[]
[]
[]
[]
[]
["Insurance Costs will be $ per One Thousand $ ($1,000)",null,null,null,null,null,null,null,null,null,null,null,null,null,null,{"$f":"'FLCC CSI Cost Estimate Summary'!P198","v":0},{"$f":"Q210*P198/1000","v":0},null,null,null,null,null,null,null,null,null,null,null,null,null,null,null,null,null,null,null,null,null,null,null,null,null,null,null,null,null,null,null,null,"*"]
["Subtotal",null,null,null,null,null,null,null,null,null,null,null,null,null,null,{"$f":"Q198+Q210","v":0}]
["Performance and Payment Bond Cost will be $ per One Thousand $ ($1,000)",null,null,null,null,null,null,null,"First ",500000,{"$f":"'FLCC CSI Cost Estimate Summary'!K200","v":0},"Balance",null,{"$f":"'FLCC CSI Cost Estimate Summary'!N200","v":0},null,null,{"$f":"IF(P199>J200,(((K200*J200)/1000))+(((P199-J200)*N200)/1000),(P199*K200)/1000)","v":0}]
["Subtotal",null,null,null,null,null,null,null,null,null,null,null,null,null,null,{"$f":"Q200+P199","v":0}]
["Total General Conditions Costs",null,null,null,null,null,null,null,null,null,null,null,null,null,null,null,{"$f":"Q188+Q198+Q200","v":0}]
[]
["C.1 Trades",null,null,null,null,null,null,null,null,null,null,null,null,null,null,null,{"$f":"Q162","v":0}]
["C.2 Subtotal General Conditions (excludes insurance and bonds)",null,null,null,null,null,null,null,null,null,null,null,null,null,null,null,{"$f":"Q188","v":0}]
["C.3.1 Pre-Construction",null,null,null,null,null,null,null,null,null,null,null,null,null,null,null,{"$f":"O226","v":0}]
["C.3.2 Construction",null,null,null,null,null,null,null,null,null,null,null,null,null,null,null,{"$f":"O250","v":0}]
["C.4.1 Pre-Construction Fee",null,null,null,null,null,null,null,null,null,null,null,null,null,null,null,{"$f":"Q274","v":0}]
["C.4.2 Construction Fee",null,null,null,null,null,null,null,null,null,null,null,null,null,null,null,{"$f":"Q283","v":0}]
["Subtotal ",null,null,null,null,null,null,null,null,null,null,null,null,null,null,null,{"$f":"SUM(Q204:R209)+Q271","v":0}]
[]
["C.3 Construction Manager Personnel Costs"]
[]
["Pre-Construction"]
[]
["Title/Name",null,null,null,null,null,null,"Hourly Rate",null,null,null,"Total Hours",null,null,"Extended Amount",null,null,null,null,null,null,null,null,null,null,null,null,null,null,null,null,null,null,null,null,null,null,null,null,null,null,null,null,null,null,null,null,null,null,"*"]
[]
[{"$f":"'FLCC CSI Cost Estimate Summary'!A218:G218","v":0},null,null,null,null,null,null,{"$f":"'FLCC CSI Cost Estimate Summary'!H218:K218","v":0},null,null,null,{"$f":"'FLCC CSI Cost Estimate Summary'!L218:N218","v":0},null,null,{"$f":"H218*L218","v":0}]
[{"$f":"'FLCC CSI Cost Estimate Summary'!A219:G219","v":0},null,null,null,null,null,null,{"$f":"'FLCC CSI Cost Estimate Summary'!H219:K219","v":0},null,null,null,{"$f":"'FLCC CSI Cost Estimate Summary'!L219:N219","v":0},null,null,0]
[{"$f":"'FLCC CSI Cost Estimate Summary'!A220:G220","v":0},null,null,null,null,null,null,{"$f":"'FLCC CSI Cost Estimate Summary'!H220:K220","v":0},null,null,null,{"$f":"'FLCC CSI Cost Estimate Summary'!L220:N220","v":0},null,null,0]
[{"$f":"'FLCC CSI Cost Estimate Summary'!A221:G221","v":0},null,null,null,null,null,null,{"$f":"'FLCC CSI Cost Estimate Summary'!H221:K221","v":0},null,null,null,{"$f":"'FLCC CSI Cost Estimate Summary'!L221:N221","v":0},null,null,0]
[{"$f":"'FLCC CSI Cost Estimate Summary'!A222:G222","v":0},null,null,null,null,null,null,{"$f":"'FLCC CSI Cost Estimate Summary'!H222:K222","v":0},null,null,null,{"$f":"'FLCC CSI Cost Estimate Summary'!L222:N222","v":0},null,null,0]
[{"$f":"'FLCC CSI Cost Estimate Summary'!A223:G223","v":0},null,null,null,null,null,null,{"$f":"'FLCC CSI Cost Estimate Summary'!H223:K223","v":0},null,null,null,{"$f":"'FLCC CSI Cost Estimate Summary'!L223:N223","v":0},null,null,0]
[{"$f":"'FLCC CSI Cost Estimate Summary'!A224:G224","v":0},null,null,null,null,null,null,{"$f":"'FLCC CSI Cost Estimate Summary'!H224:K224","v":0},null,null,null,{"$f":"'FLCC CSI Cost Estimate Summary'!L224:N224","v":0},null,null,{"$f":"H224*L224","v":0}]
[]
["Subtotal",null,null,null,null,null,null,null,null,null,null,null,null,null,{"$f":"SUBTOTAL(9,O218:P225)","v":0}]
[]
[]
[]
[]
[]
[]
[]
[]
[]
[]
[]
["Construction"]
[]
["Title/Name",null,null,null,null,null,null,"Hourly Rate",null,null,null,"Total Hours",null,null,"Extended Amount",null,null,null,null,null,null,null,null,null,null,null,null,null,null,null,null,null,null,null,null,null,null,null,null,null,null,null,null,null,null,null,null,null,null,"*"]
[]
[{"$f":"'FLCC CSI Cost Estimate Summary'!A242:G242","v":0},null,null,null,null,null,null,{"$f":"'FLCC CSI Cost Estimate Summary'!H242:K242","v":0},null,null,null,{"$f":"'FLCC CSI Cost Estimate Summary'!L242:N242","v":0},null,null,{"$f":"H242*L242","v":0}]
[{"$f":"'FLCC CSI Cost Estimate Summary'!A243:G243","v":0},null,null,null,null,null,null,{"$f":"'FLCC CSI Cost Estimate Summary'!H243:K243","v":0},null,null,null,{"$f":"'FLCC CSI Cost Estimate Summary'!L243:N243","v":0},null,null,0]
[{"$f":"'FLCC CSI Cost Estimate Summary'!A244:G244","v":0},null,null,null,null,null,null,{"$f":"'FLCC CSI Cost Estimate Summary'!H244:K244","v":0},null,null,null,{"$f":"'FLCC CSI Cost Estimate Summary'!L244:N244","v":0},null,null,0]
[{"$f":"'FLCC CSI Cost Estimate Summary'!A245:G245","v":0},null,null,null,null,null,null,{"$f":"'FLCC CSI Cost Estimate Summary'!H245:K245","v":0},null,null,null,{"$f":"'FLCC CSI Cost Estimate Summary'!L245:N245","v":0},null,null,0]
[{"$f":"'FLCC CSI Cost Estimate Summary'!A246:G246","v":0},null,null,null,null,null,null,{"$f":"'FLCC CSI Cost Estimate Summary'!H246:K246","v":0},null,null,null,{"$f":"'FLCC CSI Cost Estimate Summary'!L246:N246","v":0},null,null,0]
[{"$f":"'FLCC CSI Cost Estimate Summary'!A247:G247","v":0},null,null,null,null,null,null,{"$f":"'FLCC CSI Cost Estimate Summary'!H247:K247","v":0},null,null,null,{"$f":"'FLCC CSI Cost Estimate Summary'!L247:N247","v":0},null,null,0]
[{"$f":"'FLCC CSI Cost Estimate Summary'!A248:G248","v":0},null,null,null,null,null,null,{"$f":"'FLCC CSI Cost Estimate Summary'!H248:K248","v":0},null,null,null,{"$f":"'FLCC CSI Cost Estimate Summary'!L248:N248","v":0},null,null,0]
[]
["Subtotal",null,null,null,null,null,null,null,null,null,null,null,null,null,{"$f":"SUBTOTAL(9,O242:P249)","v":0}]
["Total Pre-Construction and Construction Personnel Costs",null,null,null,null,null,null,null,null,null,null,"Lump Sum",null,null,{"$f":"O250+O226","v":0}]
[]
[]
[]
[]
[]
[]
[]
[]
[]
[]
[]
[]
[]
["C.4.CM Fee"]
["Pre-Construction - Fee is based upon",null,null,null,null,null,null,null,null,0.04,"of Total Pre-Construction Personnel Costs and Pre-Construction Reimbursable Values"]
[]
["Pre-Construction Fee",null,null,null,null,null,null,null,null,null,null,null,null,null,null,null,"Amount",null,null,null,null,null,null,null,null,null,null,null,null,null,null,null,null,null,null,null,null,null,null,null,null,null,null,null,null,null,null,null,null,"*"]
["Pre-Construction Personnel Costs from Section B.3.1 Construction Manager Personnel Costs",null,null,null,null,null,null,null,null,null,null,null,null,null,null,null,{"$f":"O226","v":0}]
["Pre-Construction Reimbursable Values",null,null,null,null,null,null,null,null,null,null,null,null,null,null,null,{"$f":"'FLCC CSI Cost Estimate Summary'!Q270:R270","v":0}]
["Pre-Purchase Equipment",null,null,null,null,null,null,null,null,null,null,null,null,null,null,null,{"$f":"'FLCC CSI Cost Estimate Summary'!Q271:R271","v":0}]
["Subtotal",null,null,null,null,null,null,null,null,null,null,null,null,null,null,null,{"$f":"Q269+Q270+Q271","v":0},null,null,null,null,null,null,null,null,null,null,null,null,null,null,null,null,null,null,null,null,null,null,null,null,null,null,null,null,null,null,null,null,"Pre-Purchase Equipment (Contractor edits)"]
["Subtotal Above Multiplied by CM Pre-Construction Fee of ",null,null,null,null,null,null,null,null,null,{"$f":"J266","v":0.04},null,null,null,null,null,{"$f":"Q272*K273","v":0}]
["Total CM Pre-Construction Fee                                                                                                                         ",null,null,null,null,null,null,null,null,null,null,null,null,null,null,"Lump Sum",{"$f":"Q273","v":0}]
[]
[]
["Construction - Fee is based upon",null,null,null,null,null,null,null,null,0.04,"of Total Trade Contractor Costs"]
[]
["Construction Fee",null,null,null,null,null,null,null,null,null,null,null,null,null,null,null,"Amount",null,null,null,null,null,null,null,null,null,null,null,null,null,null,null,null,null,null,null,null,null,null,null,null,null,null,null,null,null,null,null,null,"*"]
["Trade Contract Costs from Section C.1 Trade Contractor Bid Summary",null,null,null,null,null,null,null,null,null,null,null,null,null,null,null,{"$f":"Q162","v":0}]
["Subtotal",null,null,null,null,null,null,null,null,null,null,null,null,null,null,null,{"$f":"Q280","v":0}]
["Subtotal Above Multiplied by CM Construction Fee of ",null,null,null,null,null,null,null,null,null,{"$f":"J277","v":0.04},null,null,null,null,null,{"$f":"Q281*K282","v":0}]
["Total CM Construction Fee                                                                                                                ",null,null,null,null,null,null,null,null,null,null,null,null,null,null,"Lump Sum",{"$f":"Q282","v":0}]
[]
["Total Pre-Construction and Construction Fee",null,null,null,null,null,null,null,null,null,null,null,null,null,"Total Lump Sum",null,{"$f":"Q283+Q274","v":0}]
[]
[]
["GMP - Trades and Construction Manager Cost Summary"]
[]
["C.1 Trade Contractor Bid",null,null,null,null,null,null,null,null,null,null,null,null,null,null,null,{"$f":"Q162","v":0}]
["C.2 CM General Conditions Total",null,null,null,null,null,null,null,null,null,null,null,null,null,null,null,{"$f":"Q202","v":0}]
["C.3 Pre-Construction Total",null,null,null,null,null,null,null,null,null,null,null,null,null,null,null,{"$f":"O226","v":0}]
["C.3 Construction Personnel Costs Total",null,null,null,null,null,null,null,null,null,null,null,null,null,null,null,{"$f":"O250","v":0}]
["C.4 CM Fee Total",null,null,null,null,null,null,null,null,null,null,null,null,null,null,null,{"$f":"Q285","v":0}]
["Pre-Construction Reimbursable Values and Pre-Purchase Equipment",null,null,null,null,null,null,null,null,null,null,null,null,null,null,null,{"$f":"Q270+Q271","v":0}]
["C.5 Construction Manager Total (Sum of C.2, C.3 and C.4)",null,null,null,null,null,null,null,null,null,null,null,null,null,null,null,{"$f":"Q291+Q292+Q294+Q295+Q293","v":0}]
["Combined Trade Contractor Bid Summary and Construction Manager Costs: "]
["Guaranteed Maximum Price (Sum of C.1, C.5 and Pre-Construction Reimbursable Values and Pre-Purchase Equipment )",null,null,null,null,null,null,null,null,null,null,null,null,null,"Grand Total Lump Sum",null,{"$f":"Q290+Q296","v":0}]
[]
[]
[]
[]
[]
[]
[]
[]
[]
[]
[]
[]
[]
[]
[]
[]
[]
[]
[]
[]
[]
[]
[]
[]
[]
[]
[]
[]
[]
[]
[]
[]
[]
[]
[]
[]
[]
[]
[]
[]
[]
[]
[]
[]
[]
[]
[]
[]
[]
[]
[]
[]
[]
[]
[]
[]
[]
[]
[]
[]
[]
[]
[]
[]
[]
[]
[]
[]
[]
[]
[]
[]
[]
[]
[]
[]
[]
[]
[]
[]
[]
[]
[]
[]
[]
[]
[]
[]
[]
[]
[]
[]
[]
[]
[]
[]
[]
[]
[]
[]
[]
[]
[]
[]
[]
[]
[]
[]
[]
[]
[]
[]
[]
[]
[]
[]
[]
[]
[]
[]
[]
[]
[]
[]
[]
[]
[]
[]
[]
[]
[]
[]
[]
[]
[]
[]
[]
[]
[]
[]
[]
[]
[]
[]
[]
[]
[]
[]
[]
[]
[]
[]
[]
[]
[]
[]
[]
[]
[]
[]
[]
[]
[]
[]
[]
[]
[]
[]
[]
[]
[]
[]
[]
[]
[]
[]
[]
[]
[]
[]
[]
[]
[]
[]
[]
[]
[]
[]
[]
[]
[]
[]
[]
[]
[]
[]
[]
[]
[]
[]
[]
[]
[]
[]
[null,null,null,null,null,null,null,null,null,null,null,null,null,null,null,null,0]
[null,null,null,null,null,null,null,0,null,null,null,0,null,null,{"$f":"H504*L504","v":0}]
[null,null,null,null,null,null,null,0,null,null,null,0,null,null,{"$f":"H505*L505","v":0}]

{"sheet":"List","index":8,"n_rows":4,"n_cols":6,"rows_kept":4,"cut":false,"hidden":true,"merged":[]}
["A.Z.Shmina","CM-073126-1",null,null,null,"A.Z.Shmina Kasco, Inc. Commercial Contracting Corporation Ideal Contracting LLC"]
["Kasco, Inc.","CM-073126-4"]
["Commercial Contracting Corporation","CM-073126-2"]
["Ideal Contracting LLC","CM-073126-3"]